{"text_format":"1","workbook":"xlsx","n_sheets":13,"sheets":["Clima Canal","cal","NL","EN","DE","FR","NR","SP","SW","TS","ExtraTaal1","ExtraTaal2","ExtraTaal3"],"not_rendered":{"charts":0,"images":5,"macros":1,"external_links":0,"defined_names":16,"comments":1,"pivot_tables":0},"unopened":[],"bounds":{"document_bytes":16777216,"sheet_cells":100000,"rows_first":2000,"rows_last":500,"rows_between":2000,"halvings":0,"cell_chars":16384,"cell_head_chars":4096},"cells_cut":0,"cells_raw":0,"read":"whole","date_system":"1900"}

{"sheet":"Clima Canal","index":0,"n_rows":73,"n_cols":16,"rows_kept":73,"cut":false,"hidden":false,"merged":[[64,1,64,15],[16,1,16,15],[22,1,22,15],[28,1,28,15],[34,1,34,15],[40,1,40,15],[3,12,3,13],[4,12,4,13],[46,1,46,15],[52,1,52,15],[58,1,58,15],[9,1,9,3],[9,6,9,9],[7,12,7,13],[8,12,8,13],[4,1,4,3],[0,12,0,16],[1,12,1,16],[2,12,2,16],[1,1,1,11],[11,1,11,3],[11,6,11,9],[9,12,9,13],[5,10,5,13],[4,6,4,9],[3,10,4,11],[10,1,10,3],[10,6,10,9],[10,12,13,13],[12,6,12,9],[3,6,3,9],[5,6,5,9]]}
[]
[null,"Selectiontool Clima Canal"]
[]
[null,null,null,null,null,null,"Taal/Language/Sprache",0,0,0,"Español"]
[null,null,null,null,null,null,"Langue/Språk/Lengua/Jazyk"]
[null,null,null,null,null,null,{"$f":"IF(cal!$S$7=1,\"Uitvoering\",IF(cal!$S$7=2,\"Version\",IF(cal!$S$7=3,\"Ausfürhung\",IF(cal!$S$7=4,\"Version\",IF(cal!$S$7=5,\"Modell\",IF(cal!$S$7=6,\"Version\",IF(cal!$S$7=7,\"Modell\",IF(cal!$S$7=8,\"Verze\",IF(cal!$S$7=9,\"Version\",IF(cal!$S$7=10,\"Version\",IF(cal!$S$7=11,\"Version\",)))))))))))","v":"Version"},null,null,null,"Clima H19 B34 2P"]
[]
[null,{"$f":"cal!B7","v":"Temperaturas"},null,null,null,null,null,null,null,null,null,null,{"$f":"cal!M7","v":"Altitud"}]
[null,{"$f":"cal!B8","v":"Calefacción:"},null,null,null,null,{"$f":"cal!G8","v":"Enfriamiento:"},null,null,null,null,null,0,0,{"$f":"cal!O8","v":"m"}]
[null,{"$f":"cal!B9","v":"Agua impulsión"},{"$f":"cal!C9","v":0},{"$f":"cal!D9","v":0},75,null,{"$f":"cal!G9","v":"Agua impulsión"},{"$f":"cal!H9","v":0},{"$f":"cal!I9","v":0},{"$f":"cal!J9","v":0},16,null,{"$f":"cal!M9","v":"Convers. de unidades"}]
[null,{"$f":"cal!B10","v":"Agua retorno"},{"$f":"cal!C10","v":0},{"$f":"cal!D10","v":0},65,null,{"$f":"cal!G10","v":"Agua retorno"},{"$f":"cal!H10","v":0},{"$f":"cal!I10","v":0},{"$f":"cal!J10","v":0},19]
[null,{"$f":"cal!B11","v":"Ambiente (bulbo seco)"},{"$f":"cal!C11","v":0},{"$f":"cal!D11","v":0},20,null,{"$f":"cal!G11","v":"Ambiente (bulbo seco)"},{"$f":"cal!H11","v":0},{"$f":"cal!I11","v":0},{"$f":"cal!J11","v":0},26]
[null,null,null,null,null,null,{"$f":"cal!G12","v":"Humedad relativa"},null,null,null,0.5]
[]
[null,null,null,{"$f":"cal!D14","v":0},{"$f":"cal!E14","v":1},{"$f":"cal!F14","v":1},3.4121416331000001,{"$f":"cal!H14","v":1},{"$f":"cal!I14","v":1},{"$f":"cal!J14","v":1},{"$f":"cal!K14","v":0},{"$f":"cal!L14","v":0},{"$f":"cal!M14","v":0},{"$f":"cal!N14","v":1}]
[null,{"$f":"cal!B15","v":"Nivel de velocidad:"},{"$f":"cal!C15","v":" Voltaje control [V]"},{"$f":"cal!D15","v":"Emisión calefacción * 75/65/20 [W]"},{"$f":"cal!E15","v":"Caudal de agua, calefacción [l/h]"},{"$f":"cal!F15","v":"Pérdida de carga del agua [kPa]"},{"$f":"cal!G15","v":"Emisión sensible Frío * 16/19/26 [W]"},{"$f":"cal!H15","v":"Emisión total Frío * 16/19/26 [W]"},{"$f":"cal!I15","v":"Caudal de agua, calefacción [l/h]"},{"$f":"cal!J15","v":"Pérdida de carga del agua [kPa]"},{"$f":"cal!K15","v":"Presión sonora *** [dB(A)]"},{"$f":"cal!L15","v":"Potencia sonora ** [dB(A)]"},{"$f":"cal!M15","v":"Potencia eléctrica absorbida [W]"},{"$f":"cal!N15","v":"Caudal de aire [m³/h]"},{"$f":"cal!O15","v":"Temperatura salida de aire calefacción [°C]"},{"$f":"cal!P15","v":"Temperatura salida de aire refrigeración [°C]"}]
[null,{"$f":"cal!B16","v":"Clima Canal altura 19 cm ancho 34 cm longitud 105 cm (Type 1)"}]
[null,{"$f":"cal!B17","v":0.2},{"$f":"cal!C17","v":2},{"$f":"IF($E$10<=$E$11,cal!$AC$3,cal!D17)","v":1245.4047763416349},{"$f":"IF($E$10<=$E$11,\"\",cal!E17)","v":107},{"$f":"IF($E$10<=$E$11,\"\",cal!F17)","v":0.31753316413095029},{"$f":"IF($K$10>=$K$11,cal!$AC$3,cal!G17)","v":141.38590046883769},{"$f":"IF($K$10>=$K$11,\"\",cal!H17)","v":141.38590046883769},{"$f":"IF($K$10>=$K$11,\"\",cal!I17)","v":41},{"$f":"IF($K$10>=$K$11,\"\",cal!J17)","v":4.662182277090815E-2},{"$f":"cal!K17","v":16.964612482003041},{"$f":"cal!L17","v":24.964612482003041},{"$f":"cal!M17","v":1.5},{"$f":"cal!N17","v":97}]
[null,{"$f":"cal!B18","v":0.4},{"$f":"cal!C18","v":4},{"$f":"IF($E$10<=$E$11,cal!$AC$4,cal!D18)","v":1965.4500742286991},{"$f":"IF($E$10<=$E$11,\"\",cal!E18)","v":169},{"$f":"IF($E$10<=$E$11,\"\",cal!F18)","v":0.79212723388453754},{"$f":"IF($K$10>=$K$11,cal!$AC$5,cal!G18)","v":276.19352473343014},{"$f":"IF($K$10>=$K$11,\"\",cal!H18)","v":276.19352473343014},{"$f":"IF($K$10>=$K$11,\"\",cal!I18)","v":79},{"$f":"IF($K$10>=$K$11,\"\",cal!J18)","v":0.17309149072768457},{"$f":"cal!K18","v":21.008364373401289},{"$f":"cal!L18","v":29.008364373401289},{"$f":"cal!M18","v":2.7},{"$f":"cal!N18","v":167}]
[null,{"$f":"cal!B19","v":0.6},{"$f":"cal!C19","v":6},{"$f":"IF($E$10<=$E$11,\"\",cal!D19)","v":2566.6887513844108},{"$f":"IF($E$10<=$E$11,\"\",cal!E19)","v":221},{"$f":"IF($E$10<=$E$11,\"\",cal!F19)","v":1.3545844413765169},{"$f":"IF($K$10>=$K$11,\"\",cal!G19)","v":408.34954092992461},{"$f":"IF($K$10>=$K$11,\"\",cal!H19)","v":408.34954092992461},{"$f":"IF($K$10>=$K$11,\"\",cal!I19)","v":117},{"$f":"IF($K$10>=$K$11,\"\",cal!J19)","v":0.37965861505708604},{"$f":"cal!K19","v":26.993900782441038},{"$f":"cal!L19","v":34.993900782441038},{"$f":"cal!M19","v":4.8},{"$f":"cal!N19","v":236}]
[null,{"$f":"cal!B20","v":0.8},{"$f":"cal!C20","v":8},{"$f":"IF($E$10<=$E$11,\"\",cal!D20)","v":3101.7979597228677},{"$f":"IF($E$10<=$E$11,\"\",cal!E20)","v":267},{"$f":"IF($E$10<=$E$11,\"\",cal!F20)","v":1.9771702103005777},{"$f":"IF($K$10>=$K$11,\"\",cal!G20)","v":538.01886773932847},{"$f":"IF($K$10>=$K$11,\"\",cal!H20)","v":538.01886773932847},{"$f":"IF($K$10>=$K$11,\"\",cal!I20)","v":154},{"$f":"IF($K$10>=$K$11,\"\",cal!J20)","v":0.65775321168046263},{"$f":"cal!K20","v":34.99363224187082},{"$f":"cal!L20","v":42.99363224187082},{"$f":"cal!M20","v":9.3000000000000007},{"$f":"cal!N20","v":309}]
[null,{"$f":"cal!B21","v":1},{"$f":"cal!C21","v":10},{"$f":"IF($E$10<=$E$11,\"\",cal!D21)","v":3592.5600611198183},{"$f":"IF($E$10<=$E$11,\"\",cal!E21)","v":309},{"$f":"IF($E$10<=$E$11,\"\",cal!F21)","v":2.6481250803028442},{"$f":"IF($K$10>=$K$11,\"\",cal!G21)","v":665.65837447413628},{"$f":"IF($K$10>=$K$11,\"\",cal!H21)","v":665.65837447413628},{"$f":"IF($K$10>=$K$11,\"\",cal!I21)","v":191},{"$f":"IF($K$10>=$K$11,\"\",cal!J21)","v":1.0117850782305178},{"$f":"cal!K21","v":39.999307043688582},{"$f":"cal!L21","v":47.999307043688582},{"$f":"cal!M21","v":15},{"$f":"cal!N21","v":351}]
[null,{"$f":"cal!B22","v":"Clima Canal altura 19 cm ancho 34 cm longitud 120 cm (Type 2)"}]
[null,{"$f":"cal!B23","v":0.2},{"$f":"cal!C23","v":2},{"$f":"IF($E$10<=$E$11,cal!$AC$3,cal!D23)","v":1547.5443966375344},{"$f":"IF($E$10<=$E$11,\"\",cal!E23)","v":133},{"$f":"IF($E$10<=$E$11,\"\",cal!F23)","v":0.50903891846260307},{"$f":"IF($K$10>=$K$11,cal!$AC$3,cal!G23)","v":175.68662188435451},{"$f":"IF($K$10>=$K$11,\"\",cal!H23)","v":175.68662188435451},{"$f":"IF($K$10>=$K$11,\"\",cal!I23)","v":50},{"$f":"IF($K$10>=$K$11,\"\",cal!J23)","v":7.1942862578806471E-2},{"$f":"cal!K23","v":18.98962805075108},{"$f":"cal!L23","v":26.98962805075108},{"$f":"cal!M23","v":3.2},{"$f":"cal!N23","v":82}]
[null,{"$f":"cal!B24","v":0.4},{"$f":"cal!C24","v":4},{"$f":"IF($E$10<=$E$11,cal!$AC$4,cal!D24)","v":2442.275240165839},{"$f":"IF($E$10<=$E$11,\"\",cal!E24)","v":210},{"$f":"IF($E$10<=$E$11,\"\",cal!F24)","v":1.269072095890146},{"$f":"IF($K$10>=$K$11,cal!$AC$5,cal!G24)","v":343.19905440248721},{"$f":"IF($K$10>=$K$11,\"\",cal!H24)","v":343.19905440248721},{"$f":"IF($K$10>=$K$11,\"\",cal!I24)","v":98},{"$f":"IF($K$10>=$K$11,\"\",cal!J24)","v":0.27637570088274294},{"$f":"cal!K24","v":22.019276797677907},{"$f":"cal!L24","v":30.019276797677907},{"$f":"cal!M24","v":6.7},{"$f":"cal!N24","v":179}]
[null,{"$f":"cal!B25","v":0.6},{"$f":"cal!C25","v":6},{"$f":"IF($E$10<=$E$11,\"\",cal!D25)","v":3189.3765549747113},{"$f":"IF($E$10<=$E$11,\"\",cal!E25)","v":274},{"$f":"IF($E$10<=$E$11,\"\",cal!F25)","v":2.1604729403865899},{"$f":"IF($K$10>=$K$11,\"\",cal!G25)","v":507.41658932120805},{"$f":"IF($K$10>=$K$11,\"\",cal!H25)","v":507.41658932120805},{"$f":"IF($K$10>=$K$11,\"\",cal!I25)","v":145},{"$f":"IF($K$10>=$K$11,\"\",cal!J25)","v":0.60503947428776239},{"$f":"cal!K25","v":27.99082010896673},{"$f":"cal!L25","v":35.99082010896673},{"$f":"cal!M25","v":12.1},{"$f":"cal!N25","v":260}]
[null,{"$f":"cal!B26","v":0.8},{"$f":"cal!C26","v":8},{"$f":"IF($E$10<=$E$11,\"\",cal!D26)","v":3854.3051570520838},{"$f":"IF($E$10<=$E$11,\"\",cal!E26)","v":331},{"$f":"IF($E$10<=$E$11,\"\",cal!F26)","v":3.1528527867986464},{"$f":"IF($K$10>=$K$11,\"\",cal!G26)","v":668.54415517904727},{"$f":"IF($K$10>=$K$11,\"\",cal!H26)","v":668.54415517904727},{"$f":"IF($K$10>=$K$11,\"\",cal!I26)","v":192},{"$f":"IF($K$10>=$K$11,\"\",cal!J26)","v":1.0608406744420487},{"$f":"cal!K26","v":36.01549794824809},{"$f":"cal!L26","v":44.01549794824809},{"$f":"cal!M26","v":18.399999999999999},{"$f":"cal!N26","v":351}]
[null,{"$f":"cal!B27","v":1},{"$f":"cal!C27","v":10},{"$f":"IF($E$10<=$E$11,\"\",cal!D27)","v":4464.1278865985905},{"$f":"IF($E$10<=$E$11,\"\",cal!E27)","v":384},{"$f":"IF($E$10<=$E$11,\"\",cal!F27)","v":4.2433626977681946},{"$f":"IF($K$10>=$K$11,\"\",cal!G27)","v":827.14945940573136},{"$f":"IF($K$10>=$K$11,\"\",cal!H27)","v":827.14945940573136},{"$f":"IF($K$10>=$K$11,\"\",cal!I27)","v":237},{"$f":"IF($K$10>=$K$11,\"\",cal!J27)","v":1.6163834592755921},{"$f":"cal!K27","v":41.003336021104822},{"$f":"cal!L27","v":49.003336021104822},{"$f":"cal!M27","v":24},{"$f":"cal!N27","v":401}]
[null,{"$f":"cal!B28","v":"Clima Canal altura 19 cm ancho 34 cm longitud 200 cm (Type 3)"}]
[null,{"$f":"cal!B29","v":0.2},{"$f":"cal!C29","v":2},{"$f":"IF($E$10<=$E$11,cal!$AC$3,cal!D29)","v":3021.3962029589957},{"$f":"IF($E$10<=$E$11,\"\",cal!E29)","v":260},{"$f":"IF($E$10<=$E$11,\"\",cal!F29)","v":2.2728907691237459},{"$f":"IF($K$10>=$K$11,cal!$AC$3,cal!G29)","v":343.00721415516836},{"$f":"IF($K$10>=$K$11,\"\",cal!H29)","v":343.00721415516836},{"$f":"IF($K$10>=$K$11,\"\",cal!I29)","v":98},{"$f":"IF($K$10>=$K$11,\"\",cal!J29)","v":0.32291187790923753},{"$f":"cal!K29","v":21.1043935579596},{"$f":"cal!L29","v":29.1043935579596},{"$f":"cal!M29","v":4.5999999999999996},{"$f":"cal!N29","v":179}]
[null,{"$f":"cal!B30","v":0.4},{"$f":"cal!C30","v":4},{"$f":"IF($E$10<=$E$11,cal!$AC$4,cal!D30)","v":4768.2516593713999},{"$f":"IF($E$10<=$E$11,\"\",cal!E30)","v":410},{"$f":"IF($E$10<=$E$11,\"\",cal!F30)","v":5.6519665427470667},{"$f":"IF($K$10>=$K$11,cal!$AC$5,cal!G30)","v":670.05529669057023},{"$f":"IF($K$10>=$K$11,\"\",cal!H30)","v":670.05529669057023},{"$f":"IF($K$10>=$K$11,\"\",cal!I30)","v":192},{"$f":"IF($K$10>=$K$11,\"\",cal!J30)","v":1.2394651673517423},{"$f":"cal!K30","v":24.553468286911865},{"$f":"cal!L30","v":32.553468286911865},{"$f":"cal!M30","v":9.4},{"$f":"cal!N30","v":346}]
[null,{"$f":"cal!B31","v":0.6},{"$f":"cal!C31","v":6},{"$f":"IF($E$10<=$E$11,\"\",cal!D31)","v":6226.8780359030079},{"$f":"IF($E$10<=$E$11,\"\",cal!E31)","v":535},{"$f":"IF($E$10<=$E$11,\"\",cal!F31)","v":9.6236414259237311},{"$f":"IF($K$10>=$K$11,\"\",cal!G31)","v":990.6704839128347},{"$f":"IF($K$10>=$K$11,\"\",cal!H31)","v":990.6704839128347},{"$f":"IF($K$10>=$K$11,\"\",cal!I31)","v":284},{"$f":"IF($K$10>=$K$11,\"\",cal!J31)","v":2.7118680158941548},{"$f":"cal!K31","v":30.531203067291003},{"$f":"cal!L31","v":38.531203067291003},{"$f":"cal!M31","v":16.899999999999999},{"$f":"cal!N31","v":496}]
[null,{"$f":"cal!B32","v":0.8},{"$f":"cal!C32","v":8},{"$f":"IF($E$10<=$E$11,\"\",cal!D32)","v":7525.0719732921634},{"$f":"IF($E$10<=$E$11,\"\",cal!E32)","v":647},{"$f":"IF($E$10<=$E$11,\"\",cal!F32)","v":14.074741597220742},{"$f":"IF($K$10>=$K$11,\"\",cal!G32)","v":1305.2528743971875},{"$f":"IF($K$10>=$K$11,\"\",cal!H32)","v":1305.2528743971875},{"$f":"IF($K$10>=$K$11,\"\",cal!I32)","v":374},{"$f":"IF($K$10>=$K$11,\"\",cal!J32)","v":4.703001023993389},{"$f":"cal!K32","v":38.544850742514384},{"$f":"cal!L32","v":46.544850742514384},{"$f":"cal!M32","v":27.7},{"$f":"cal!N32","v":660}]
[null,{"$f":"cal!B33","v":1},{"$f":"cal!C33","v":10},{"$f":"IF($E$10<=$E$11,\"\",cal!D33)","v":8715.6782547877228},{"$f":"IF($E$10<=$E$11,\"\",cal!E33)","v":749},{"$f":"IF($E$10<=$E$11,\"\",cal!F33)","v":18.862337194810511},{"$f":"IF($K$10>=$K$11,\"\",cal!G33)","v":1614.9108493159515},{"$f":"IF($K$10>=$K$11,\"\",cal!H33)","v":1614.9108493159515},{"$f":"IF($K$10>=$K$11,\"\",cal!I33)","v":463},{"$f":"IF($K$10>=$K$11,\"\",cal!J33)","v":7.2076526817498268},{"$f":"cal!K33","v":43.540571811172136},{"$f":"cal!L33","v":51.540571811172136},{"$f":"cal!M33","v":38.9},{"$f":"cal!N33","v":752}]
[null,{"$f":"cal!B34","v":"Clima Canal altura 19 cm ancho 34 cm longitud 280 cm (Type 4)"}]
[null,{"$f":"cal!B35","v":0.2},{"$f":"cal!C35","v":2},{"$f":"IF($E$10<=$E$11,cal!$AC$3,cal!D35)","v":4495.2480092804572},{"$f":"IF($E$10<=$E$11,\"\",cal!E35)","v":387},{"$f":"IF($E$10<=$E$11,\"\",cal!F35)","v":5.6635321830477565},{"$f":"IF($K$10>=$K$11,cal!$AC$3,cal!G35)","v":510.3278064259822},{"$f":"IF($K$10>=$K$11,\"\",cal!H35)","v":510.3278064259822},{"$f":"IF($K$10>=$K$11,\"\",cal!I35)","v":146},{"$f":"IF($K$10>=$K$11,\"\",cal!J35)","v":0.80606702330820112},{"$f":"cal!K35","v":22.520451931056087},{"$f":"cal!L35","v":30.520451931056087},{"$f":"cal!M35","v":6.1},{"$f":"cal!N35","v":276}]
[null,{"$f":"cal!B36","v":0.4},{"$f":"cal!C36","v":4},{"$f":"IF($E$10<=$E$11,cal!$AC$4,cal!D36)","v":7094.2280785769608},{"$f":"IF($E$10<=$E$11,\"\",cal!E36)","v":610},{"$f":"IF($E$10<=$E$11,\"\",cal!F36)","v":14.071004849548773},{"$f":"IF($K$10>=$K$11,cal!$AC$5,cal!G36)","v":996.91153897865331},{"$f":"IF($K$10>=$K$11,\"\",cal!H36)","v":996.91153897865331},{"$f":"IF($K$10>=$K$11,\"\",cal!I36)","v":286},{"$f":"IF($K$10>=$K$11,\"\",cal!J36)","v":3.0931252692117481},{"$f":"cal!K36","v":26.143327309406075},{"$f":"cal!L36","v":34.143327309406075},{"$f":"cal!M36","v":12.1},{"$f":"cal!N36","v":513}]
[null,{"$f":"cal!B37","v":0.6},{"$f":"cal!C37","v":6},{"$f":"IF($E$10<=$E$11,\"\",cal!D37)","v":9264.3795168313045},{"$f":"IF($E$10<=$E$11,\"\",cal!E37)","v":797},{"$f":"IF($E$10<=$E$11,\"\",cal!F37)","v":24.020502336675698},{"$f":"IF($K$10>=$K$11,\"\",cal!G37)","v":1473.9243785044616},{"$f":"IF($K$10>=$K$11,\"\",cal!H37)","v":1473.9243785044616},{"$f":"IF($K$10>=$K$11,\"\",cal!I37)","v":422},{"$f":"IF($K$10>=$K$11,\"\",cal!J37)","v":6.7342672067375542},{"$f":"cal!K37","v":32.123455182150146},{"$f":"cal!L37","v":40.123455182150146},{"$f":"cal!M37","v":21.7},{"$f":"cal!N37","v":732}]
[null,{"$f":"cal!B38","v":0.8},{"$f":"cal!C38","v":8},{"$f":"IF($E$10<=$E$11,\"\",cal!D38)","v":11195.838789532243},{"$f":"IF($E$10<=$E$11,\"\",cal!E38)","v":963},{"$f":"IF($E$10<=$E$11,\"\",cal!F38)","v":35.068566773236221},{"$f":"IF($K$10>=$K$11,\"\",cal!G38)","v":1941.9615936153275},{"$f":"IF($K$10>=$K$11,\"\",cal!H38)","v":1941.9615936153275},{"$f":"IF($K$10>=$K$11,\"\",cal!I38)","v":557},{"$f":"IF($K$10>=$K$11,\"\",cal!J38)","v":11.732102078924099},{"$f":"cal!K38","v":40.132836242894129},{"$f":"cal!L38","v":48.132836242894129},{"$f":"cal!M38","v":37},{"$f":"cal!N38","v":969}]
[null,{"$f":"cal!B39","v":1},{"$f":"cal!C39","v":10},{"$f":"IF($E$10<=$E$11,\"\",cal!D39)","v":12967.228622976858},{"$f":"IF($E$10<=$E$11,\"\",cal!E39)","v":1115},{"$f":"IF($E$10<=$E$11,\"\",cal!F39)","v":47.012698210374289},{"$f":"IF($K$10>=$K$11,\"\",cal!G39)","v":2402.6722392261718},{"$f":"IF($K$10>=$K$11,\"\",cal!H39)","v":2402.6722392261718},{"$f":"IF($K$10>=$K$11,\"\",cal!I39)","v":689},{"$f":"IF($K$10>=$K$11,\"\",cal!J39)","v":17.951629919867358},{"$f":"cal!K39","v":45.131608091109797},{"$f":"cal!L39","v":53.131608091109797},{"$f":"cal!M39","v":53.8},{"$f":"cal!N39","v":1103}]
[null,{"$f":"IF(cal!$X$16=1,\"\",IF(cal!$X$16=2,\"\",cal!B40))","v":"Clima Canal altura 0 cm ancho 0 cm longitud 0 cm (Type 5)"}]
[null,{"$f":"cal!B41","v":0.2},{"$f":"cal!C41","v":2},{"$f":"IF($E$10<=$E$11,cal!$AC$3,cal!D41)","v":0},{"$f":"IF($E$10<=$E$11,\"\",cal!E41)","v":0},{"$f":"IF($E$10<=$E$11,\"\",cal!F41)","v":{"$error":"#NUM!"}},{"$f":"IF($K$10>=$K$11,cal!$AC$3,cal!G41)","v":0},{"$f":"IF($K$10>=$K$11,\"\",cal!H41)","v":0},{"$f":"IF($K$10>=$K$11,\"\",cal!I41)","v":0},{"$f":"IF($K$10>=$K$11,\"\",cal!J41)","v":{"$error":"#NUM!"}},{"$f":"IF(cal!K41=-8,\"\",cal!K41)","v":""},{"$f":"IF(cal!L41=0,\"\",cal!L41)","v":""},{"$f":"IF(cal!M41=0,\"\",cal!M41)","v":""},{"$f":"IF(cal!N41=0,\"\",cal!N41)","v":""}]
[null,{"$f":"cal!B42","v":0.4},{"$f":"cal!C42","v":4},{"$f":"IF($E$10<=$E$11,cal!$AC$4,cal!D42)","v":0},{"$f":"IF($E$10<=$E$11,\"\",cal!E42)","v":0},{"$f":"IF($E$10<=$E$11,\"\",cal!F42)","v":{"$error":"#NUM!"}},{"$f":"IF($K$10>=$K$11,cal!$AC$5,cal!G42)","v":0},{"$f":"IF($K$10>=$K$11,\"\",cal!H42)","v":0},{"$f":"IF($K$10>=$K$11,\"\",cal!I42)","v":0},{"$f":"IF($K$10>=$K$11,\"\",cal!J42)","v":{"$error":"#NUM!"}},{"$f":"IF(cal!K42=-8,\"\",cal!K42)","v":""},{"$f":"IF(cal!L42=0,\"\",cal!L42)","v":""},{"$f":"IF(cal!M42=0,\"\",cal!M42)","v":""},{"$f":"IF(cal!N42=0,\"\",cal!N42)","v":""}]
[null,{"$f":"cal!B43","v":0.6},{"$f":"cal!C43","v":6},{"$f":"IF($E$10<=$E$11,\"\",cal!D43)","v":0},{"$f":"IF($E$10<=$E$11,\"\",cal!E43)","v":0},{"$f":"IF($E$10<=$E$11,\"\",cal!F43)","v":{"$error":"#NUM!"}},{"$f":"IF($K$10>=$K$11,\"\",cal!G43)","v":0},{"$f":"IF($K$10>=$K$11,\"\",cal!H43)","v":0},{"$f":"IF($K$10>=$K$11,\"\",cal!I43)","v":0},{"$f":"IF($K$10>=$K$11,\"\",cal!J43)","v":{"$error":"#NUM!"}},{"$f":"IF(cal!K43=-8,\"\",cal!K43)","v":""},{"$f":"IF(cal!L43=0,\"\",cal!L43)","v":""},{"$f":"IF(cal!M43=0,\"\",cal!M43)","v":""},{"$f":"IF(cal!N43=0,\"\",cal!N43)","v":""}]
[null,{"$f":"cal!B44","v":0.8},{"$f":"cal!C44","v":8},{"$f":"IF($E$10<=$E$11,\"\",cal!D44)","v":0},{"$f":"IF($E$10<=$E$11,\"\",cal!E44)","v":0},{"$f":"IF($E$10<=$E$11,\"\",cal!F44)","v":{"$error":"#NUM!"}},{"$f":"IF($K$10>=$K$11,\"\",cal!G44)","v":0},{"$f":"IF($K$10>=$K$11,\"\",cal!H44)","v":0},{"$f":"IF($K$10>=$K$11,\"\",cal!I44)","v":0},{"$f":"IF($K$10>=$K$11,\"\",cal!J44)","v":{"$error":"#NUM!"}},{"$f":"IF(cal!K44=-8,\"\",cal!K44)","v":""},{"$f":"IF(cal!L44=0,\"\",cal!L44)","v":""},{"$f":"IF(cal!M44=0,\"\",cal!M44)","v":""},{"$f":"IF(cal!N44=0,\"\",cal!N44)","v":""}]
[null,{"$f":"cal!B45","v":1},{"$f":"cal!C45","v":10},{"$f":"IF($E$10<=$E$11,\"\",cal!D45)","v":0},{"$f":"IF($E$10<=$E$11,\"\",cal!E45)","v":0},{"$f":"IF($E$10<=$E$11,\"\",cal!F45)","v":{"$error":"#NUM!"}},{"$f":"IF($K$10>=$K$11,\"\",cal!G45)","v":0},{"$f":"IF($K$10>=$K$11,\"\",cal!H45)","v":0},{"$f":"IF($K$10>=$K$11,\"\",cal!I45)","v":0},{"$f":"IF($K$10>=$K$11,\"\",cal!J45)","v":{"$error":"#NUM!"}},{"$f":"IF(cal!K45=-8,\"\",cal!K45)","v":""},{"$f":"IF(cal!L45=0,\"\",cal!L45)","v":""},{"$f":"IF(cal!M45=0,\"\",cal!M45)","v":""},{"$f":"IF(cal!N45=0,\"\",cal!N45)","v":""}]
[null,{"$f":"IF(cal!$X$16=1,\"\",IF(cal!$X$16=2,\"\",cal!B46))","v":"Clima Canal altura 0 cm ancho 0 cm longitud 0 cm (Type 6)"}]
[null,{"$f":"cal!B47","v":0.2},{"$f":"cal!C47","v":2},{"$f":"IF($E$10<=$E$11,cal!$AC$3,cal!D47)","v":0},{"$f":"IF($E$10<=$E$11,\"\",cal!E47)","v":0},{"$f":"IF($E$10<=$E$11,\"\",cal!F47)","v":{"$error":"#NUM!"}},{"$f":"IF($K$10>=$K$11,cal!$AC$3,cal!G47)","v":0},{"$f":"IF($K$10>=$K$11,\"\",cal!H47)","v":0},{"$f":"IF($K$10>=$K$11,\"\",cal!I47)","v":0},{"$f":"IF($K$10>=$K$11,\"\",cal!J47)","v":{"$error":"#NUM!"}},{"$f":"IF(cal!K47=-8,\"\",cal!K47)","v":""},{"$f":"IF(cal!L47=0,\"\",cal!L47)","v":""},{"$f":"IF(cal!M47=0,\"\",cal!M47)","v":""},{"$f":"IF(cal!N47=0,\"\",cal!N47)","v":""}]
[null,{"$f":"cal!B48","v":0.4},{"$f":"cal!C48","v":4},{"$f":"IF($E$10<=$E$11,cal!$AC$4,cal!D48)","v":0},{"$f":"IF($E$10<=$E$11,\"\",cal!E48)","v":0},{"$f":"IF($E$10<=$E$11,\"\",cal!F48)","v":{"$error":"#NUM!"}},{"$f":"IF($K$10>=$K$11,cal!$AC$5,cal!G48)","v":0},{"$f":"IF($K$10>=$K$11,\"\",cal!H48)","v":0},{"$f":"IF($K$10>=$K$11,\"\",cal!I48)","v":0},{"$f":"IF($K$10>=$K$11,\"\",cal!J48)","v":{"$error":"#NUM!"}},{"$f":"IF(cal!K48=-8,\"\",cal!K48)","v":""},{"$f":"IF(cal!L48=0,\"\",cal!L48)","v":""},{"$f":"IF(cal!M48=0,\"\",cal!M48)","v":""},{"$f":"IF(cal!N48=0,\"\",cal!N48)","v":""}]
[null,{"$f":"cal!B49","v":0.6},{"$f":"cal!C49","v":6},{"$f":"IF($E$10<=$E$11,\"\",cal!D49)","v":0},{"$f":"IF($E$10<=$E$11,\"\",cal!E49)","v":0},{"$f":"IF($E$10<=$E$11,\"\",cal!F49)","v":{"$error":"#NUM!"}},{"$f":"IF($K$10>=$K$11,\"\",cal!G49)","v":0},{"$f":"IF($K$10>=$K$11,\"\",cal!H49)","v":0},{"$f":"IF($K$10>=$K$11,\"\",cal!I49)","v":0},{"$f":"IF($K$10>=$K$11,\"\",cal!J49)","v":{"$error":"#NUM!"}},{"$f":"IF(cal!K49=-8,\"\",cal!K49)","v":""},{"$f":"IF(cal!L49=0,\"\",cal!L49)","v":""},{"$f":"IF(cal!M49=0,\"\",cal!M49)","v":""},{"$f":"IF(cal!N49=0,\"\",cal!N49)","v":""}]
[null,{"$f":"cal!B50","v":0.8},{"$f":"cal!C50","v":8},{"$f":"IF($E$10<=$E$11,\"\",cal!D50)","v":0},{"$f":"IF($E$10<=$E$11,\"\",cal!E50)","v":0},{"$f":"IF($E$10<=$E$11,\"\",cal!F50)","v":{"$error":"#NUM!"}},{"$f":"IF($K$10>=$K$11,\"\",cal!G50)","v":0},{"$f":"IF($K$10>=$K$11,\"\",cal!H50)","v":0},{"$f":"IF($K$10>=$K$11,\"\",cal!I50)","v":0},{"$f":"IF($K$10>=$K$11,\"\",cal!J50)","v":{"$error":"#NUM!"}},{"$f":"IF(cal!K50=-8,\"\",cal!K50)","v":""},{"$f":"IF(cal!L50=0,\"\",cal!L50)","v":""},{"$f":"IF(cal!M50=0,\"\",cal!M50)","v":""},{"$f":"IF(cal!N50=0,\"\",cal!N50)","v":""}]
[null,{"$f":"cal!B51","v":1},{"$f":"cal!C51","v":10},{"$f":"IF($E$10<=$E$11,\"\",cal!D51)","v":0},{"$f":"IF($E$10<=$E$11,\"\",cal!E51)","v":0},{"$f":"IF($E$10<=$E$11,\"\",cal!F51)","v":{"$error":"#NUM!"}},{"$f":"IF($K$10>=$K$11,\"\",cal!G51)","v":0},{"$f":"IF($K$10>=$K$11,\"\",cal!H51)","v":0},{"$f":"IF($K$10>=$K$11,\"\",cal!I51)","v":0},{"$f":"IF($K$10>=$K$11,\"\",cal!J51)","v":{"$error":"#NUM!"}},{"$f":"IF(cal!K51=-8,\"\",cal!K51)","v":""},{"$f":"IF(cal!L51=0,\"\",cal!L51)","v":""},{"$f":"IF(cal!M51=0,\"\",cal!M51)","v":""},{"$f":"IF(cal!N51=0,\"\",cal!N51)","v":""}]
[null,{"$f":"IF(cal!$X$16=1,\"\",IF(cal!$X$16=2,\"\",cal!B52))","v":"Clima Canal altura 0 cm ancho 0 cm longitud 0 cm (Type 7)"}]
[null,{"$f":"cal!B53","v":0.2},{"$f":"cal!C53","v":2},{"$f":"IF($E$10<=$E$11,cal!$AC$3,cal!D53)","v":0},{"$f":"IF($E$10<=$E$11,\"\",cal!E53)","v":0},{"$f":"IF($E$10<=$E$11,\"\",cal!F53)","v":{"$error":"#NUM!"}},{"$f":"IF($K$10>=$K$11,cal!$AC$3,cal!G53)","v":0},{"$f":"IF($K$10>=$K$11,\"\",cal!H53)","v":0},{"$f":"IF($K$10>=$K$11,\"\",cal!I53)","v":0},{"$f":"IF($K$10>=$K$11,\"\",cal!J53)","v":{"$error":"#NUM!"}},{"$f":"IF(cal!K53=-8,\"\",cal!K53)","v":""},{"$f":"IF(cal!L53=0,\"\",cal!L53)","v":""},{"$f":"IF(cal!M53=0,\"\",cal!M53)","v":""},{"$f":"IF(cal!N53=0,\"\",cal!N53)","v":""}]
[null,{"$f":"cal!B54","v":0.4},{"$f":"cal!C54","v":4},{"$f":"IF($E$10<=$E$11,cal!$AC$4,cal!D54)","v":0},{"$f":"IF($E$10<=$E$11,\"\",cal!E54)","v":0},{"$f":"IF($E$10<=$E$11,\"\",cal!F54)","v":{"$error":"#NUM!"}},{"$f":"IF($K$10>=$K$11,cal!$AC$5,cal!G54)","v":0},{"$f":"IF($K$10>=$K$11,\"\",cal!H54)","v":0},{"$f":"IF($K$10>=$K$11,\"\",cal!I54)","v":0},{"$f":"IF($K$10>=$K$11,\"\",cal!J54)","v":{"$error":"#NUM!"}},{"$f":"IF(cal!K54=-8,\"\",cal!K54)","v":""},{"$f":"IF(cal!L54=0,\"\",cal!L54)","v":""},{"$f":"IF(cal!M54=0,\"\",cal!M54)","v":""},{"$f":"IF(cal!N54=0,\"\",cal!N54)","v":""}]
[null,{"$f":"cal!B55","v":0.6},{"$f":"cal!C55","v":6},{"$f":"IF($E$10<=$E$11,\"\",cal!D55)","v":0},{"$f":"IF($E$10<=$E$11,\"\",cal!E55)","v":0},{"$f":"IF($E$10<=$E$11,\"\",cal!F55)","v":{"$error":"#NUM!"}},{"$f":"IF($K$10>=$K$11,\"\",cal!G55)","v":0},{"$f":"IF($K$10>=$K$11,\"\",cal!H55)","v":0},{"$f":"IF($K$10>=$K$11,\"\",cal!I55)","v":0},{"$f":"IF($K$10>=$K$11,\"\",cal!J55)","v":{"$error":"#NUM!"}},{"$f":"IF(cal!K55=-8,\"\",cal!K55)","v":""},{"$f":"IF(cal!L55=0,\"\",cal!L55)","v":""},{"$f":"IF(cal!M55=0,\"\",cal!M55)","v":""},{"$f":"IF(cal!N55=0,\"\",cal!N55)","v":""}]
[null,{"$f":"cal!B56","v":0.8},{"$f":"cal!C56","v":8},{"$f":"IF($E$10<=$E$11,\"\",cal!D56)","v":0},{"$f":"IF($E$10<=$E$11,\"\",cal!E56)","v":0},{"$f":"IF($E$10<=$E$11,\"\",cal!F56)","v":{"$error":"#NUM!"}},{"$f":"IF($K$10>=$K$11,\"\",cal!G56)","v":0},{"$f":"IF($K$10>=$K$11,\"\",cal!H56)","v":0},{"$f":"IF($K$10>=$K$11,\"\",cal!I56)","v":0},{"$f":"IF($K$10>=$K$11,\"\",cal!J56)","v":{"$error":"#NUM!"}},{"$f":"IF(cal!K56=-8,\"\",cal!K56)","v":""},{"$f":"IF(cal!L56=0,\"\",cal!L56)","v":""},{"$f":"IF(cal!M56=0,\"\",cal!M56)","v":""},{"$f":"IF(cal!N56=0,\"\",cal!N56)","v":""}]
[null,{"$f":"cal!B57","v":1},{"$f":"cal!C57","v":10},{"$f":"IF($E$10<=$E$11,\"\",cal!D57)","v":0},{"$f":"IF($E$10<=$E$11,\"\",cal!E57)","v":0},{"$f":"IF($E$10<=$E$11,\"\",cal!F57)","v":{"$error":"#NUM!"}},{"$f":"IF($K$10>=$K$11,\"\",cal!G57)","v":0},{"$f":"IF($K$10>=$K$11,\"\",cal!H57)","v":0},{"$f":"IF($K$10>=$K$11,\"\",cal!I57)","v":0},{"$f":"IF($K$10>=$K$11,\"\",cal!J57)","v":{"$error":"#NUM!"}},{"$f":"IF(cal!K57=-8,\"\",cal!K57)","v":""},{"$f":"IF(cal!L57=0,\"\",cal!L57)","v":""},{"$f":"IF(cal!M57=0,\"\",cal!M57)","v":""},{"$f":"IF(cal!N57=0,\"\",cal!N57)","v":""}]
[null,{"$f":"IF(cal!$X$16=1,\"\",IF(cal!$X$16=2,\"\",cal!B58))","v":"Clima Canal altura 0 cm ancho 0 cm longitud 0 cm (Type 8)"}]
[null,{"$f":"cal!B59","v":0.2},{"$f":"cal!C59","v":2},{"$f":"IF($E$10<=$E$11,cal!$AC$3,cal!D59)","v":0},{"$f":"IF($E$10<=$E$11,\"\",cal!E59)","v":0},{"$f":"IF($E$10<=$E$11,\"\",cal!F59)","v":{"$error":"#NUM!"}},{"$f":"IF($K$10>=$K$11,cal!$AC$3,cal!G59)","v":0},{"$f":"IF($K$10>=$K$11,\"\",cal!H59)","v":0},{"$f":"IF($K$10>=$K$11,\"\",cal!I59)","v":0},{"$f":"IF($K$10>=$K$11,\"\",cal!J59)","v":{"$error":"#NUM!"}},{"$f":"IF(cal!K59=-8,\"\",cal!K59)","v":""},{"$f":"IF(cal!L59=0,\"\",cal!L59)","v":""},{"$f":"IF(cal!M59=0,\"\",cal!M59)","v":""},{"$f":"IF(cal!N59=0,\"\",cal!N59)","v":""}]
[null,{"$f":"cal!B60","v":0.4},{"$f":"cal!C60","v":4},{"$f":"IF($E$10<=$E$11,cal!$AC$4,cal!D60)","v":0},{"$f":"IF($E$10<=$E$11,\"\",cal!E60)","v":0},{"$f":"IF($E$10<=$E$11,\"\",cal!F60)","v":{"$error":"#NUM!"}},{"$f":"IF($K$10>=$K$11,cal!$AC$5,cal!G60)","v":0},{"$f":"IF($K$10>=$K$11,\"\",cal!H60)","v":0},{"$f":"IF($K$10>=$K$11,\"\",cal!I60)","v":0},{"$f":"IF($K$10>=$K$11,\"\",cal!J60)","v":{"$error":"#NUM!"}},{"$f":"IF(cal!K60=-8,\"\",cal!K60)","v":""},{"$f":"IF(cal!L60=0,\"\",cal!L60)","v":""},{"$f":"IF(cal!M60=0,\"\",cal!M60)","v":""},{"$f":"IF(cal!N60=0,\"\",cal!N60)","v":""}]
[null,{"$f":"cal!B61","v":0.6},{"$f":"cal!C61","v":6},{"$f":"IF($E$10<=$E$11,\"\",cal!D61)","v":0},{"$f":"IF($E$10<=$E$11,\"\",cal!E61)","v":0},{"$f":"IF($E$10<=$E$11,\"\",cal!F61)","v":{"$error":"#NUM!"}},{"$f":"IF($K$10>=$K$11,\"\",cal!G61)","v":0},{"$f":"IF($K$10>=$K$11,\"\",cal!H61)","v":0},{"$f":"IF($K$10>=$K$11,\"\",cal!I61)","v":0},{"$f":"IF($K$10>=$K$11,\"\",cal!J61)","v":{"$error":"#NUM!"}},{"$f":"IF(cal!K61=-8,\"\",cal!K61)","v":""},{"$f":"IF(cal!L61=0,\"\",cal!L61)","v":""},{"$f":"IF(cal!M61=0,\"\",cal!M61)","v":""},{"$f":"IF(cal!N61=0,\"\",cal!N61)","v":""}]
[null,{"$f":"cal!B62","v":0.8},{"$f":"cal!C62","v":8},{"$f":"IF($E$10<=$E$11,\"\",cal!D62)","v":0},{"$f":"IF($E$10<=$E$11,\"\",cal!E62)","v":0},{"$f":"IF($E$10<=$E$11,\"\",cal!F62)","v":{"$error":"#NUM!"}},{"$f":"IF($K$10>=$K$11,\"\",cal!G62)","v":0},{"$f":"IF($K$10>=$K$11,\"\",cal!H62)","v":0},{"$f":"IF($K$10>=$K$11,\"\",cal!I62)","v":0},{"$f":"IF($K$10>=$K$11,\"\",cal!J62)","v":{"$error":"#NUM!"}},{"$f":"IF(cal!K62=-8,\"\",cal!K62)","v":""},{"$f":"IF(cal!L62=0,\"\",cal!L62)","v":""},{"$f":"IF(cal!M62=0,\"\",cal!M62)","v":""},{"$f":"IF(cal!N62=0,\"\",cal!N62)","v":""}]
[null,{"$f":"cal!B63","v":1},{"$f":"cal!C63","v":10},{"$f":"IF($E$10<=$E$11,\"\",cal!D63)","v":0},{"$f":"IF($E$10<=$E$11,\"\",cal!E63)","v":0},{"$f":"IF($E$10<=$E$11,\"\",cal!F63)","v":{"$error":"#NUM!"}},{"$f":"IF($K$10>=$K$11,\"\",cal!G63)","v":0},{"$f":"IF($K$10>=$K$11,\"\",cal!H63)","v":0},{"$f":"IF($K$10>=$K$11,\"\",cal!I63)","v":0},{"$f":"IF($K$10>=$K$11,\"\",cal!J63)","v":{"$error":"#NUM!"}},{"$f":"IF(cal!K63=-8,\"\",cal!K63)","v":""},{"$f":"IF(cal!L63=0,\"\",cal!L63)","v":""},{"$f":"IF(cal!M63=0,\"\",cal!M63)","v":""},{"$f":"IF(cal!N63=0,\"\",cal!N63)","v":""}]
[null,{"$f":"IF(cal!$X$16=1,\"\",IF(cal!$X$16=2,\"\",cal!B64))","v":"Clima Canal altura 0 cm ancho 0 cm longitud 0 cm (Type 9)"}]
[null,{"$f":"cal!B65","v":0.2},{"$f":"cal!C65","v":2},{"$f":"IF($E$10<=$E$11,cal!$AC$3,cal!D65)","v":0},{"$f":"IF($E$10<=$E$11,\"\",cal!E65)","v":0},{"$f":"IF($E$10<=$E$11,\"\",cal!F65)","v":{"$error":"#NUM!"}},{"$f":"IF($K$10>=$K$11,cal!$AC$3,cal!G65)","v":0},{"$f":"IF($K$10>=$K$11,\"\",cal!H65)","v":0},{"$f":"IF($K$10>=$K$11,\"\",cal!I65)","v":0},{"$f":"IF($K$10>=$K$11,\"\",cal!J65)","v":{"$error":"#NUM!"}},{"$f":"IF(cal!K65=-8,\"\",cal!K65)","v":""},{"$f":"IF(cal!L65=0,\"\",cal!L65)","v":""},{"$f":"IF(cal!M65=0,\"\",cal!M65)","v":""},{"$f":"IF(cal!N65=0,\"\",cal!N65)","v":""}]
[null,{"$f":"cal!B66","v":0.4},{"$f":"cal!C66","v":4},{"$f":"IF($E$10<=$E$11,cal!$AC$4,cal!D66)","v":0},{"$f":"IF($E$10<=$E$11,\"\",cal!E66)","v":0},{"$f":"IF($E$10<=$E$11,\"\",cal!F66)","v":{"$error":"#NUM!"}},{"$f":"IF($K$10>=$K$11,cal!$AC$5,cal!G66)","v":0},{"$f":"IF($K$10>=$K$11,\"\",cal!H66)","v":0},{"$f":"IF($K$10>=$K$11,\"\",cal!I66)","v":0},{"$f":"IF($K$10>=$K$11,\"\",cal!J66)","v":{"$error":"#NUM!"}},{"$f":"IF(cal!K66=-8,\"\",cal!K66)","v":""},{"$f":"IF(cal!L66=0,\"\",cal!L66)","v":""},{"$f":"IF(cal!M66=0,\"\",cal!M66)","v":""},{"$f":"IF(cal!N66=0,\"\",cal!N66)","v":""}]
[null,{"$f":"cal!B67","v":0.6},{"$f":"cal!C67","v":6},{"$f":"IF($E$10<=$E$11,\"\",cal!D67)","v":0},{"$f":"IF($E$10<=$E$11,\"\",cal!E67)","v":0},{"$f":"IF($E$10<=$E$11,\"\",cal!F67)","v":{"$error":"#NUM!"}},{"$f":"IF($K$10>=$K$11,\"\",cal!G67)","v":0},{"$f":"IF($K$10>=$K$11,\"\",cal!H67)","v":0},{"$f":"IF($K$10>=$K$11,\"\",cal!I67)","v":0},{"$f":"IF($K$10>=$K$11,\"\",cal!J67)","v":{"$error":"#NUM!"}},{"$f":"IF(cal!K67=-8,\"\",cal!K67)","v":""},{"$f":"IF(cal!L67=0,\"\",cal!L67)","v":""},{"$f":"IF(cal!M67=0,\"\",cal!M67)","v":""},{"$f":"IF(cal!N67=0,\"\",cal!N67)","v":""}]
[null,{"$f":"cal!B68","v":0.8},{"$f":"cal!C68","v":8},{"$f":"IF($E$10<=$E$11,\"\",cal!D68)","v":0},{"$f":"IF($E$10<=$E$11,\"\",cal!E68)","v":0},{"$f":"IF($E$10<=$E$11,\"\",cal!F68)","v":{"$error":"#NUM!"}},{"$f":"IF($K$10>=$K$11,\"\",cal!G68)","v":0},{"$f":"IF($K$10>=$K$11,\"\",cal!H68)","v":0},{"$f":"IF($K$10>=$K$11,\"\",cal!I68)","v":0},{"$f":"IF($K$10>=$K$11,\"\",cal!J68)","v":{"$error":"#NUM!"}},{"$f":"IF(cal!K68=-8,\"\",cal!K68)","v":""},{"$f":"IF(cal!L68=0,\"\",cal!L68)","v":""},{"$f":"IF(cal!M68=0,\"\",cal!M68)","v":""},{"$f":"IF(cal!N68=0,\"\",cal!N68)","v":""}]
[null,{"$f":"cal!B69","v":1},{"$f":"cal!C69","v":10},{"$f":"IF($E$10<=$E$11,\"\",cal!D69)","v":0},{"$f":"IF($E$10<=$E$11,\"\",cal!E69)","v":0},{"$f":"IF($E$10<=$E$11,\"\",cal!F69)","v":{"$error":"#NUM!"}},{"$f":"IF($K$10>=$K$11,\"\",cal!G69)","v":0},{"$f":"IF($K$10>=$K$11,\"\",cal!H69)","v":0},{"$f":"IF($K$10>=$K$11,\"\",cal!I69)","v":0},{"$f":"IF($K$10>=$K$11,\"\",cal!J69)","v":{"$error":"#NUM!"}},{"$f":"IF(cal!K69=-8,\"\",cal!K69)","v":""},{"$f":"IF(cal!L69=0,\"\",cal!L69)","v":""},{"$f":"IF(cal!M69=0,\"\",cal!M69)","v":""},{"$f":"IF(cal!N69=0,\"\",cal!N69)","v":""}]
[null,{"$f":"cal!B70","v":"*La potencia de enfriamiento se calcula según la norma EN 16430 con ventiladores de todas las alturas."},null,null,null,null,null,null,null,null,null,null,null,null,null,"v2021-04-19"]
[null,{"$f":"cal!B71","v":"**Potencia sonora según ISO 3741: 2010."}]
[null,{"$f":"cal!B72","v":"***Nivel de presión acústica con una amortiguación ambiental supuesta de 8 dB (A)."}]

{"sheet":"cal","index":1,"n_rows":72,"n_cols":84,"rows_kept":72,"cut":false,"hidden":true,"merged":[[63,1,63,15],[57,1,57,15],[51,1,51,15],[45,1,45,15],[39,1,39,15],[6,12,6,13],[7,12,7,13],[15,70,15,76],[15,77,15,83],[15,55,15,61],[15,62,15,68],[15,37,15,43],[15,48,15,54],[6,14,6,15],[7,14,7,15],[15,30,15,36],[15,23,15,29],[33,1,33,15],[27,1,27,15],[21,1,21,15],[15,1,15,15],[8,12,8,13],[8,1,8,3],[8,6,8,9],[9,1,9,3],[9,6,9,9],[10,1,10,3],[10,6,10,9]]}
[null,null,null,null,null,null,"Nederlands","English","Deutsch","Français","Norsk","Español","Svenska","Čeština","ExtraTaal1","ExtraTaal2","ExtraTaal3",null,null,null,{"$f":"IF($S$7=1,NL!Q7,IF($S$7=2,EN!Q7,IF($S$7=3,DE!Q7,IF($S$7=4,FR!Q7,IF($S$7=5,NR!Q7,IF($S$7=6,SP!Q7,IF($S$7=7,SW!Q7,IF($S$7=8,TS!Q7,IF($S$7=9,ExtraTaal1!Q7,IF($S$7=10,ExtraTaal2!Q7,IF($S$7=11,ExtraTaal3!Q7,)))))))))))","v":"Copiar todos los datos"},null,null,null,null,"Clima Canal"]
[null,null,null,null,null,null,null,null,null,null,null,null,null,null,null,null,null,null,null,null,{"$f":"IF($S$7=1,NL!Q8,IF($S$7=2,EN!Q8,IF($S$7=3,DE!Q8,IF($S$7=4,FR!Q8,IF($S$7=5,NR!Q8,IF($S$7=6,SP!Q8,IF($S$7=7,SW!Q8,IF($S$7=8,TS!Q8,IF($S$7=9,ExtraTaal1!Q8,IF($S$7=10,ExtraTaal2!Q8,IF($S$7=11,ExtraTaal3!Q8,)))))))))))","v":"Unidades-SI"},null,null,null,"Clima H8 B18",{"$f":"AE16","v":"Clima H8 B18"}]
[null,{"$f":"IF($S$7=1,NL!A2,IF(cal!$S$7=2,EN!A2,IF(cal!$S$7=3,DE!A2,IF(cal!$S$7=4,FR!A2,))))","v":0},null,null,null,null,null,null,null,null,null,null,null,null,null,null,null,null,null,null,{"$f":"IF($S$7=1,NL!Q9,IF($S$7=2,EN!Q9,IF($S$7=3,DE!Q9,IF($S$7=4,FR!Q9,IF($S$7=5,NR!Q9,IF($S$7=6,SP!Q9,IF($S$7=7,SW!Q9,IF($S$7=8,TS!Q9,IF($S$7=9,ExtraTaal1!Q9,IF($S$7=10,ExtraTaal2!Q9,IF($S$7=11,ExtraTaal3!Q9,)))))))))))","v":"Unidades-Imperial"},null,null,null,"Clima H10 B18",{"$f":"AL16","v":"Clima H10 B18"},null,null,{"$f":"IF($S$7=1,NL!Q15,IF(cal!$S$7=2,EN!Q15,IF(cal!$S$7=3,DE!Q15,IF(cal!$S$7=4,FR!Q15,IF(cal!$S$7=5,NR!Q15,IF(cal!$S$7=6,SP!Q15,))))))","v":"Temp."}]
[null,null,null,null,null,null,null,null,null,null,null,null,null,null,null,null,null,null,null,null,null,null,null,1,"Clima H13 B27 4P",{"$f":"AW16","v":"Clima H13 B27 4P"},null,null,{"$f":"IF($S$7=1,NL!Q16,IF(cal!$S$7=2,EN!Q16,IF(cal!$S$7=3,DE!Q16,IF(cal!$S$7=4,FR!Q16,IF(cal!$S$7=5,NR!Q16,IF(cal!$S$7=6,SP!Q16,))))))","v":"calefac."}]
[null,{"$f":"IF($S$7=1,NL!A4,IF(cal!$S$7=2,EN!A4,IF(cal!$S$7=3,DE!A4,IF(cal!$S$7=4,FR!A4,))))","v":0},null,null,null,null,null,null,null,null,null,null,null,null,null,null,null,null,null,null,null,null,null,null,"Clima H13 B32 2P",{"$f":"BK16","v":"Clima H13 B32 2P"},null,null,{"$f":"IF($S$7=1,NL!Q17,IF(cal!$S$7=2,EN!Q17,IF(cal!$S$7=3,DE!Q17,IF(cal!$S$7=4,FR!Q17,IF(cal!$S$7=5,NR!Q17,IF(cal!$S$7=6,SP!Q17,))))))","v":"enfria."}]
[null,null,null,null,null,null,null,null,null,null,null,null,null,null,null,null,null,null,null,null,null,null,null,null,"Clima H13 B32 4P",{"$f":"BD16","v":"Clima H13 B32 4P"}]
[null,{"$f":"IF($S$7=1,NL!A6,IF(cal!$S$7=2,EN!A6,IF(cal!$S$7=3,DE!A6,IF(cal!$S$7=4,FR!A6,IF(cal!$S$7=5,NR!A6,IF(cal!$S$7=6,SP!A6,IF(cal!$S$7=7,SW!A6,IF(cal!$S$7=8,TS!A6,IF(cal!$S$7=9,ExtraTaal1!A6,IF(cal!$S$7=10,ExtraTaal2!A6,IF(cal!$S$7=11,ExtraTaal3!A6,)))))))))))","v":"Temperaturas"},null,null,null,null,null,null,null,null,null,null,{"$f":"IF($S$7=1,NL!L6,IF(cal!$S$7=2,EN!L6,IF(cal!$S$7=3,DE!L6,IF(cal!$S$7=4,FR!L6,IF(cal!$S$7=5,NR!L6,IF(cal!$S$7=6,SP!L6,IF(cal!$S$7=7,SW!L6,IF(cal!$S$7=8,TS!L6,IF(cal!$S$7=9,ExtraTaal1!L6,IF(cal!$S$7=10,ExtraTaal2!L6,IF(cal!$S$7=11,ExtraTaal3!L6,)))))))))))","v":"Altitud"},{"$f":"IF($S$7=1,NL!M6,IF(cal!$S$7=2,EN!M6,IF(cal!$S$7=3,DE!M6,IF(cal!$S$7=4,FR!M6,IF(cal!$S$7=5,NR!M6,IF(cal!$S$7=6,SP!M6,IF(cal!$S$7=7,SW!M6,IF(cal!$S$7=8,TS!M6,IF(cal!$S$7=9,ExtraTaal1!M6,IF(cal!$S$7=10,ExtraTaal2!M6,IF(cal!$S$7=11,ExtraTaal3!M6,)))))))))))","v":0},null,null,null,null,{"$f":"IF('Clima Canal'!$K$4=cal!G1,1,IF('Clima Canal'!$K$4=cal!H1,2,IF('Clima Canal'!$K$4=cal!I1,3,IF('Clima Canal'!$K$4=cal!J1,4,IF('Clima Canal'!$K$4=cal!K1,5,IF('Clima Canal'!$K$4=cal!L1,6,IF('Clima Canal'!$K$4=cal!M1,7,IF('Clima Canal'!$K$4=cal!N1,8,IF('Clima Canal'!$K$4=cal!O1,9,IF('Clima Canal'!$K$4=cal!P1,10,IF('Clima Canal'!$K$4=cal!Q1,11,)))))))))))","v":6},null,null,null,null,null,"Clima H19 B34 2P",{"$f":"BZ16","v":"Clima H19 B34 2P"}]
[null,{"$f":"IF($S$7=1,NL!A7,IF(cal!$S$7=2,EN!A7,IF(cal!$S$7=3,DE!A7,IF(cal!$S$7=4,FR!A7,IF(cal!$S$7=5,NR!A7,IF(cal!$S$7=6,SP!A7,IF(cal!$S$7=7,SW!A7,IF(cal!$S$7=8,TS!A7,IF(cal!$S$7=9,ExtraTaal1!A7,IF(cal!$S$7=10,ExtraTaal2!A7,IF(cal!$S$7=11,ExtraTaal3!A7,)))))))))))","v":"Calefacción:"},null,null,null,null,{"$f":"IF($S$7=1,NL!F7,IF(cal!$S$7=2,EN!F7,IF(cal!$S$7=3,DE!F7,IF(cal!$S$7=4,FR!F7,IF(cal!$S$7=5,NR!F7,IF(cal!$S$7=6,SP!F7,IF(cal!$S$7=7,SW!F7,IF(cal!$S$7=8,TS!F7,IF(cal!$S$7=9,ExtraTaal1!F7,IF(cal!$S$7=10,ExtraTaal2!F7,IF(cal!$S$7=11,ExtraTaal3!F7,)))))))))))","v":"Enfriamiento:"},null,null,null,null,null,{"$f":"'Clima Canal'!M9:N9","v":0},0,{"$f":"IF($X$4=1,\"m\",IF($X$4=2,\"ft\"))","v":"m"},null,null,null,"Temp",null,null,null,null,"Temp","Clima H19 B34 4P",{"$f":"BS16","v":"Clima H19 B34 4P"}]
[null,{"$f":"IF($S$7=1,NL!A8,IF(cal!$S$7=2,EN!A8,IF(cal!$S$7=3,DE!A8,IF(cal!$S$7=4,FR!A8,IF(cal!$S$7=5,NR!A8,IF(cal!$S$7=6,SP!A8,IF(cal!$S$7=7,SW!A8,IF(cal!$S$7=8,TS!A8,IF(cal!$S$7=9,ExtraTaal1!A8,IF(cal!$S$7=10,ExtraTaal2!A8,IF(cal!$S$7=11,ExtraTaal3!A8,)))))))))))","v":"Agua impulsión"},{"$f":"IF($S$7=1,NL!B8,IF(cal!$S$7=2,EN!B8,IF(cal!$S$7=3,DE!B8,IF(cal!$S$7=4,FR!B8,IF(cal!$S$7=5,NR!B8,IF(cal!$S$7=6,SP!B8,IF(cal!$S$7=7,SW!B8,IF(cal!$S$7=8,TS!B8,IF(cal!$S$7=9,ExtraTaal1!B8,IF(cal!$S$7=10,ExtraTaal2!B8,IF(cal!$S$7=11,ExtraTaal3!B8,)))))))))))","v":0},{"$f":"IF($S$7=1,NL!C8,IF(cal!$S$7=2,EN!C8,IF(cal!$S$7=3,DE!C8,IF(cal!$S$7=4,FR!C8,IF(cal!$S$7=5,NR!C8,IF(cal!$S$7=6,SP!C8,IF(cal!$S$7=7,SW!C8,IF(cal!$S$7=8,TS!C8,IF(cal!$S$7=9,ExtraTaal1!C8,IF(cal!$S$7=10,ExtraTaal2!C8,IF(cal!$S$7=11,ExtraTaal3!C8,)))))))))))","v":0},{"$f":"'Clima Canal'!E10","v":75},null,{"$f":"B9","v":"Agua impulsión"},{"$f":"IF($S$7=1,NL!G8,IF(cal!$S$7=2,EN!G8,IF(cal!$S$7=3,DE!G8,IF(cal!$S$7=4,FR!G8,))))","v":0},{"$f":"IF($S$7=1,NL!H8,IF(cal!$S$7=2,EN!H8,IF(cal!$S$7=3,DE!H8,IF(cal!$S$7=4,FR!H8,))))","v":0},{"$f":"IF($S$7=1,NL!I8,IF(cal!$S$7=2,EN!I8,IF(cal!$S$7=3,DE!I8,IF(cal!$S$7=4,FR!I8,))))","v":0},{"$f":"'Clima Canal'!K10","v":16},null,{"$f":"IF($S$7=1,NL!L8,IF(cal!$S$7=2,EN!L8,IF(cal!$S$7=3,DE!L8,IF(cal!$S$7=4,FR!L8,IF(cal!$S$7=5,NR!L8,IF(cal!$S$7=6,SP!L8,IF(cal!$S$7=7,SW!L8,IF(cal!$S$7=8,TS!L8,IF(cal!$S$7=9,ExtraTaal1!L8,IF(cal!$S$7=10,ExtraTaal2!L8,IF(cal!$S$7=11,ExtraTaal3!L8,)))))))))))","v":"Convers. de unidades"},{"$f":"IF($S$7=1,NL!M8,IF(cal!$S$7=2,EN!M8,IF(cal!$S$7=3,DE!M8,IF(cal!$S$7=4,FR!M8,IF(cal!$S$7=5,NR!M8,IF(cal!$S$7=6,SP!M8,IF(cal!$S$7=7,SW!M8,IF(cal!$S$7=8,TS!M8,IF(cal!$S$7=9,ExtraTaal1!M8,IF(cal!$S$7=10,ExtraTaal2!M8,IF(cal!$S$7=11,ExtraTaal3!M8,)))))))))))","v":0},null,null,null,null,{"$f":"IF($X$4=1,E9,IF($X$4=2,(E9-32)/1.8))","v":75},null,null,null,null,{"$f":"IF($X$4=1,K9,IF($X$4=2,(K9-32)/1.8))","v":16}]
[null,{"$f":"IF($S$7=1,NL!A9,IF(cal!$S$7=2,EN!A9,IF(cal!$S$7=3,DE!A9,IF(cal!$S$7=4,FR!A9,IF(cal!$S$7=5,NR!A9,IF(cal!$S$7=6,SP!A9,IF(cal!$S$7=7,SW!A9,IF(cal!$S$7=8,TS!A9,IF(cal!$S$7=9,ExtraTaal1!A9,IF(cal!$S$7=10,ExtraTaal2!A9,IF(cal!$S$7=11,ExtraTaal3!A9,)))))))))))","v":"Agua retorno"},{"$f":"IF($S$7=1,NL!B9,IF(cal!$S$7=2,EN!B9,IF(cal!$S$7=3,DE!B9,IF(cal!$S$7=4,FR!B9,IF(cal!$S$7=5,NR!B9,IF(cal!$S$7=6,SP!B9,IF(cal!$S$7=7,SW!B9,IF(cal!$S$7=8,TS!B9,IF(cal!$S$7=9,ExtraTaal1!B9,IF(cal!$S$7=10,ExtraTaal2!B9,IF(cal!$S$7=11,ExtraTaal3!B9,)))))))))))","v":0},{"$f":"IF($S$7=1,NL!C9,IF(cal!$S$7=2,EN!C9,IF(cal!$S$7=3,DE!C9,IF(cal!$S$7=4,FR!C9,IF(cal!$S$7=5,NR!C9,IF(cal!$S$7=6,SP!C9,IF(cal!$S$7=7,SW!C9,IF(cal!$S$7=8,TS!C9,IF(cal!$S$7=9,ExtraTaal1!C9,IF(cal!$S$7=10,ExtraTaal2!C9,IF(cal!$S$7=11,ExtraTaal3!C9,)))))))))))","v":0},{"$f":"'Clima Canal'!E11","v":65},null,{"$f":"B10","v":"Agua retorno"},{"$f":"IF($S$7=1,NL!G9,IF(cal!$S$7=2,EN!G9,IF(cal!$S$7=3,DE!G9,IF(cal!$S$7=4,FR!G9,))))","v":0},{"$f":"IF($S$7=1,NL!H9,IF(cal!$S$7=2,EN!H9,IF(cal!$S$7=3,DE!H9,IF(cal!$S$7=4,FR!H9,))))","v":0},{"$f":"IF($S$7=1,NL!I9,IF(cal!$S$7=2,EN!I9,IF(cal!$S$7=3,DE!I9,IF(cal!$S$7=4,FR!I9,))))","v":0},{"$f":"'Clima Canal'!K11","v":19},null,null,null,null,null,null,null,{"$f":"IF($X$4=1,E10,IF($X$4=2,(E10-32)/1.8))","v":65},"CF,h",null,null,"CF,c",{"$f":"IF($X$4=1,K10,IF($X$4=2,(K10-32)/1.8))","v":19},null,"p_atm","h[mm]","cf_h"]
[null,{"$f":"IF($S$7=1,NL!A10,IF(cal!$S$7=2,EN!A10,IF(cal!$S$7=3,DE!A10,IF(cal!$S$7=4,FR!A10,IF(cal!$S$7=5,NR!A10,IF(cal!$S$7=6,SP!A10,IF(cal!$S$7=7,SW!A10,IF(cal!$S$7=8,TS!A10,IF(cal!$S$7=9,ExtraTaal1!A10,IF(cal!$S$7=10,ExtraTaal2!A10,IF(cal!$S$7=11,ExtraTaal3!A10,)))))))))))","v":"Ambiente (bulbo seco)"},{"$f":"IF($S$7=1,NL!B10,IF(cal!$S$7=2,EN!B10,IF(cal!$S$7=3,DE!B10,IF(cal!$S$7=4,FR!B10,IF(cal!$S$7=5,NR!B10,IF(cal!$S$7=6,SP!B10,IF(cal!$S$7=7,SW!B10,IF(cal!$S$7=8,TS!B10,IF(cal!$S$7=9,ExtraTaal1!B10,IF(cal!$S$7=10,ExtraTaal2!B10,IF(cal!$S$7=11,ExtraTaal3!B10,)))))))))))","v":0},{"$f":"IF($S$7=1,NL!C10,IF(cal!$S$7=2,EN!C10,IF(cal!$S$7=3,DE!C10,IF(cal!$S$7=4,FR!C10,IF(cal!$S$7=5,NR!C10,IF(cal!$S$7=6,SP!C10,IF(cal!$S$7=7,SW!C10,IF(cal!$S$7=8,TS!C10,IF(cal!$S$7=9,ExtraTaal1!C10,IF(cal!$S$7=10,ExtraTaal2!C10,IF(cal!$S$7=11,ExtraTaal3!C10,)))))))))))","v":0},{"$f":"'Clima Canal'!E12","v":20},null,{"$f":"B11","v":"Ambiente (bulbo seco)"},{"$f":"IF($S$7=1,NL!G10,IF(cal!$S$7=2,EN!G10,IF(cal!$S$7=3,DE!G10,IF(cal!$S$7=4,FR!G10,))))","v":0},null,null,{"$f":"'Clima Canal'!K12","v":26},null,null,null,null,null,null,null,{"$f":"IF($X$4=1,E11,IF($X$4=2,(E11-32)/1.8))","v":20},{"$f":"(($S$9-$S$10)/LN(($S$9-$S$11)/($S$10-$S$11)))/((75-65)/LN((75-20)/(65-20)))","v":1},null,null,{"$f":"(($X$9-$X$10)/LN(($X$9-$X$11)/($X$10-$X$11)))/((16-18)/LN((16-27)/(18-27)))","v":0.84392259200840292},{"$f":"IF($X$4=1,K11,IF($X$4=2,(K11-32)/1.8))","v":26},null,{"$f":"IF($X$4=1,(101325*(1-((0.0065*M8)/(288.15)))^((9.81*0.028964)/(8.31447*0.0065))),IF($X$4=2,(101325*(1-((0.0065*(M8*0.3048))/(288.15)))^((9.81*0.028964)/(8.31447*0.0065)))))","v":101325},{"$f":"IF($X$4=1,M8/1000,IF($X$4=2,M8*0.0003048))","v":0},{"$f":"-(0.000265264729874266*AA11^6)+(0.000957582908802335*AA11^5)+(0.00470250661483425*AA11^4)-(0.0298716926548353*AA11^3)+(0.0557086806557086*AA11^2)-(0.0484008125693582*AA11)+1","v":1}]
[null,{"$f":"G12","v":"Humedad relativa"},null,null,0.5,null,{"$f":"IF($S$7=1,NL!F11,IF(cal!$S$7=2,EN!F11,IF(cal!$S$7=3,DE!F11,IF(cal!$S$7=4,FR!F11,IF(cal!$S$7=5,NR!F11,IF(cal!$S$7=6,SP!F11,IF(cal!$S$7=7,SW!F11,IF(cal!$S$7=8,TS!F11,IF(cal!$S$7=9,ExtraTaal1!F11,IF(cal!$S$7=10,ExtraTaal2!F11,IF(cal!$S$7=11,ExtraTaal3!F11,)))))))))))","v":"Humedad relativa"},null,null,null,{"$f":"'Clima Canal'!K13","v":0.5}]
[]
[null,null,null,null,{"$f":"IF($X$4=1,1,IF($X$4=2,0.004403))","v":1},{"$f":"IF($X$4=1,1,IF($X$4=2,4.0147))","v":1},{"$f":"IF($X$4=1,0.000334444444444444,IF($X$4=2,0.000568224721372))","v":3.3444444444444401E-4},{"$f":"IF($X$4=1,1,IF($X$4=2,3.4121416331))","v":1},{"$f":"IF($X$4=1,1,IF($X$4=2,0.004403))","v":1},{"$f":"IF($X$4=1,1,IF($X$4=2,4.0147))","v":1},null,null,null,{"$f":"IF($X$4=1,1,IF($X$4=2,0.588575))","v":1},{"$f":"IF($X$4=1,1,1.8)","v":1},{"$f":"IF($X$4=1,0,32)","v":0},null,null,"8 & 10","13/27","13/32",19]
[null,{"$f":"IF($S$7=1,NL!A14,IF(cal!$S$7=2,EN!A14,IF(cal!$S$7=3,DE!A14,IF(cal!$S$7=4,FR!A14,IF(cal!$S$7=5,NR!A14,IF(cal!$S$7=6,SP!A14,IF(cal!$S$7=7,SW!A14,IF(cal!$S$7=8,TS!A14,IF(cal!$S$7=9,ExtraTaal1!A14,IF(cal!$S$7=10,ExtraTaal2!A14,IF(cal!$S$7=11,ExtraTaal3!A14,)))))))))))","v":"Nivel de velocidad:"},{"$f":"IF($S$7=1,NL!B14,IF(cal!$S$7=2,EN!B14,IF(cal!$S$7=3,DE!B14,IF(cal!$S$7=4,FR!B14,IF(cal!$S$7=5,NR!B14,IF(cal!$S$7=6,SP!B14,IF(cal!$S$7=7,SW!B14,IF(cal!$S$7=8,TS!B14,IF(cal!$S$7=9,ExtraTaal1!B14,IF(cal!$S$7=10,ExtraTaal2!B14,IF(cal!$S$7=11,ExtraTaal3!B14,)))))))))))","v":" Voltaje control [V]"},{"$f":"IF($S$7=1,NL!C14,IF(cal!$S$7=2,EN!C14,IF(cal!$S$7=3,DE!C14,IF(cal!$S$7=4,FR!C14,IF(cal!$S$7=5,NR!C14,IF(cal!$S$7=6,SP!C14,IF(cal!$S$7=7,SW!C14,IF(cal!$S$7=8,TS!C14,IF(cal!$S$7=9,ExtraTaal1!C14,IF(cal!$S$7=10,ExtraTaal2!C14,IF(cal!$S$7=11,ExtraTaal3!C14,)))))))))))","v":"Emisión calefacción * 75/65/20 [W]"},{"$f":"IF($S$7=1,NL!D14,IF(cal!$S$7=2,EN!D14,IF(cal!$S$7=3,DE!D14,IF(cal!$S$7=4,FR!D14,IF(cal!$S$7=5,NR!D14,IF(cal!$S$7=6,SP!D14,IF(cal!$S$7=7,SW!D14,IF(cal!$S$7=8,TS!D14,IF(cal!$S$7=9,ExtraTaal1!D14,IF(cal!$S$7=10,ExtraTaal2!D14,IF(cal!$S$7=11,ExtraTaal3!D14,)))))))))))","v":"Caudal de agua, calefacción [l/h]"},{"$f":"IF($S$7=1,NL!E14,IF(cal!$S$7=2,EN!E14,IF(cal!$S$7=3,DE!E14,IF(cal!$S$7=4,FR!E14,IF(cal!$S$7=5,NR!E14,IF(cal!$S$7=6,SP!E14,IF(cal!$S$7=7,SW!E14,IF(cal!$S$7=8,TS!E14,IF(cal!$S$7=9,ExtraTaal1!E14,IF(cal!$S$7=10,ExtraTaal2!E14,IF(cal!$S$7=11,ExtraTaal3!E14,)))))))))))","v":"Pérdida de carga del agua [kPa]"},{"$f":"IF($S$7=1,NL!F14,IF(cal!$S$7=2,EN!F14,IF(cal!$S$7=3,DE!F14,IF(cal!$S$7=4,FR!F14,IF(cal!$S$7=5,NR!F14,IF(cal!$S$7=6,SP!F14,IF(cal!$S$7=7,SW!F14,IF(cal!$S$7=8,TS!F14,IF(cal!$S$7=9,ExtraTaal1!F14,IF(cal!$S$7=10,ExtraTaal2!F14,IF(cal!$S$7=11,ExtraTaal3!F14,)))))))))))","v":"Emisión sensible Frío * 16/19/26 [W]"},{"$f":"IF($S$7=1,NL!G14,IF(cal!$S$7=2,EN!G14,IF(cal!$S$7=3,DE!G14,IF(cal!$S$7=4,FR!G14,IF(cal!$S$7=5,NR!G14,IF(cal!$S$7=6,SP!G14,IF(cal!$S$7=7,SW!G14,IF(cal!$S$7=8,TS!G14,IF(cal!$S$7=9,ExtraTaal1!G14,IF(cal!$S$7=10,ExtraTaal2!G14,IF(cal!$S$7=11,ExtraTaal3!G14,)))))))))))","v":"Emisión total Frío * 16/19/26 [W]"},{"$f":"IF($S$7=1,NL!H14,IF(cal!$S$7=2,EN!H14,IF(cal!$S$7=3,DE!H14,IF(cal!$S$7=4,FR!H14,IF(cal!$S$7=5,NR!H14,IF(cal!$S$7=6,SP!H14,IF(cal!$S$7=7,SW!H14,IF(cal!$S$7=8,TS!H14,IF(cal!$S$7=9,ExtraTaal1!H14,IF(cal!$S$7=10,ExtraTaal2!H14,IF(cal!$S$7=11,ExtraTaal3!H14,)))))))))))","v":"Caudal de agua, calefacción [l/h]"},{"$f":"IF($S$7=1,NL!I14,IF(cal!$S$7=2,EN!I14,IF(cal!$S$7=3,DE!I14,IF(cal!$S$7=4,FR!I14,IF(cal!$S$7=5,NR!I14,IF(cal!$S$7=6,SP!I14,IF(cal!$S$7=7,SW!I14,IF(cal!$S$7=8,TS!I14,IF(cal!$S$7=9,ExtraTaal1!I14,IF(cal!$S$7=10,ExtraTaal2!I14,IF(cal!$S$7=11,ExtraTaal3!I14,)))))))))))","v":"Pérdida de carga del agua [kPa]"},{"$f":"IF($S$7=1,NL!J14,IF(cal!$S$7=2,EN!J14,IF(cal!$S$7=3,DE!J14,IF(cal!$S$7=4,FR!J14,IF(cal!$S$7=5,NR!J14,IF(cal!$S$7=6,SP!J14,IF(cal!$S$7=7,SW!J14,IF(cal!$S$7=8,TS!J14,IF(cal!$S$7=9,ExtraTaal1!J14,IF(cal!$S$7=10,ExtraTaal2!J14,IF(cal!$S$7=11,ExtraTaal3!J14,)))))))))))","v":"Presión sonora *** [dB(A)]"},{"$f":"IF($S$7=1,NL!K14,IF(cal!$S$7=2,EN!K14,IF(cal!$S$7=3,DE!K14,IF(cal!$S$7=4,FR!K14,IF(cal!$S$7=5,NR!K14,IF(cal!$S$7=6,SP!K14,IF(cal!$S$7=7,SW!K14,IF(cal!$S$7=8,TS!K14,IF(cal!$S$7=9,ExtraTaal1!K14,IF(cal!$S$7=10,ExtraTaal2!K14,IF(cal!$S$7=11,ExtraTaal3!K14,)))))))))))","v":"Potencia sonora ** [dB(A)]"},{"$f":"IF($S$7=1,NL!L14,IF(cal!$S$7=2,EN!L14,IF(cal!$S$7=3,DE!L14,IF(cal!$S$7=4,FR!L14,IF(cal!$S$7=5,NR!L14,IF(cal!$S$7=6,SP!L14,IF(cal!$S$7=7,SW!L14,IF(cal!$S$7=8,TS!L14,IF(cal!$S$7=9,ExtraTaal1!L14,IF(cal!$S$7=10,ExtraTaal2!L14,IF(cal!$S$7=11,ExtraTaal3!L14,)))))))))))","v":"Potencia eléctrica absorbida [W]"},{"$f":"IF($S$7=1,NL!M14,IF(cal!$S$7=2,EN!M14,IF(cal!$S$7=3,DE!M14,IF(cal!$S$7=4,FR!M14,IF(cal!$S$7=5,NR!M14,IF(cal!$S$7=6,SP!M14,IF(cal!$S$7=7,SW!M14,IF(cal!$S$7=8,TS!M14,IF(cal!$S$7=9,ExtraTaal1!M14,IF(cal!$S$7=10,ExtraTaal2!M14,IF(cal!$S$7=11,ExtraTaal3!M14,)))))))))))","v":"Caudal de aire [m³/h]"},{"$f":"IF($S$7=1,NL!N14,IF(cal!$S$7=2,EN!N14,IF(cal!$S$7=3,DE!N14,IF(cal!$S$7=4,FR!N14,IF(cal!$S$7=5,NR!N14,IF(cal!$S$7=6,SP!N14,IF(cal!$S$7=7,SW!N14,IF(cal!$S$7=8,TS!N14,IF(cal!$S$7=9,ExtraTaal1!N14,IF(cal!$S$7=10,ExtraTaal2!N14,IF(cal!$S$7=11,ExtraTaal3!N14,)))))))))))","v":"Temperatura salida de aire calefacción [°C]"},{"$f":"IF($S$7=1,NL!O14,IF(cal!$S$7=2,EN!O14,IF(cal!$S$7=3,DE!O14,IF(cal!$S$7=4,FR!O14,IF(cal!$S$7=5,NR!O14,IF(cal!$S$7=6,SP!O14,IF(cal!$S$7=7,SW!O14,IF(cal!$S$7=8,TS!O14,IF(cal!$S$7=9,ExtraTaal1!O14,IF(cal!$S$7=10,ExtraTaal2!O14,IF(cal!$S$7=11,ExtraTaal3!O14,)))))))))))","v":"Temperatura salida de aire refrigeración [°C]"},"n- heating","n- cooling","n- cooling","n- cooling","n- cooling","n- cooling",null,"Q_verw","dP_verw","Q_voelb_c","dP_cool","Geluid_P","P_elek","V_air","Q_verw","dP_verw","Q_voelb_c","dP_cool","Geluid_P","P_elek","V_air","Q_verw","dP_verw","Q_voelb_c","dP_cool","Geluid_P","P_elek","V_air",null,null,null,null,"Q_verw","dP_verw","Q_voelb_c","dP_cool","Geluid_P","P_elek","V_air","Q_verw","dP_verw","Q_voelb_c","dP_cool","Geluid_P","P_elek","V_air","Q_verw","dP_verw","Q_voelb_c","dP_cool","Geluid_P","P_elek","V_air",null,"Q_verw","dP_verw","Q_voelb_c","dP_cool","Geluid_P","P_elek","V_air","Q_verw","dP_verw","Q_voelb_c","dP_cool","Geluid_P","P_elek","V_air"]
[null,{"$f":"IF($S$7=1,NL!A15,IF(cal!$S$7=2,EN!A15,IF(cal!$S$7=3,DE!A15,IF(cal!$S$7=4,FR!A15,IF(cal!$S$7=5,NR!A15,IF(cal!$S$7=6,SP!A15,IF(cal!$S$7=7,SW!A15,IF(cal!$S$7=8,TS!A15,IF(cal!$S$7=9,ExtraTaal1!A15,IF(cal!$S$7=10,ExtraTaal2!A15,IF(cal!$S$7=11,ExtraTaal3!A15,)))))))))))","v":"Clima Canal altura 19 cm ancho 34 cm longitud 105 cm (Type 1)"},{"$f":"IF($S$7=1,NL!B15,IF(cal!$S$7=2,EN!B15,IF(cal!$S$7=3,DE!B15,IF(cal!$S$7=4,FR!B15,IF(cal!$S$7=5,NR!B15,IF(cal!$S$7=6,SP!B15,IF(cal!$S$7=7,SW!B15,IF(cal!$S$7=8,TS!B15,IF(cal!$S$7=9,ExtraTaal1!B15,IF(cal!$S$7=10,ExtraTaal2!B15,IF(cal!$S$7=11,ExtraTaal3!B15,)))))))))))","v":0},{"$f":"IF($S$7=1,NL!C15,IF(cal!$S$7=2,EN!C15,IF(cal!$S$7=3,DE!C15,IF(cal!$S$7=4,FR!C15,IF(cal!$S$7=5,NR!C15,IF(cal!$S$7=6,SP!C15,IF(cal!$S$7=7,SW!C15,IF(cal!$S$7=8,TS!C15,IF(cal!$S$7=9,ExtraTaal1!C15,IF(cal!$S$7=10,ExtraTaal2!C15,IF(cal!$S$7=11,ExtraTaal3!C15,)))))))))))","v":0},{"$f":"IF($S$7=1,NL!D15,IF(cal!$S$7=2,EN!D15,IF(cal!$S$7=3,DE!D15,IF(cal!$S$7=4,FR!D15,IF(cal!$S$7=5,NR!D15,IF(cal!$S$7=6,SP!D15,IF(cal!$S$7=7,SW!D15,IF(cal!$S$7=8,TS!D15,IF(cal!$S$7=9,ExtraTaal1!D15,IF(cal!$S$7=10,ExtraTaal2!D15,IF(cal!$S$7=11,ExtraTaal3!D15,)))))))))))","v":0},{"$f":"IF($S$7=1,NL!E15,IF(cal!$S$7=2,EN!E15,IF(cal!$S$7=3,DE!E15,IF(cal!$S$7=4,FR!E15,IF(cal!$S$7=5,NR!E15,IF(cal!$S$7=6,SP!E15,IF(cal!$S$7=7,SW!E15,IF(cal!$S$7=8,TS!E15,IF(cal!$S$7=9,ExtraTaal1!E15,IF(cal!$S$7=10,ExtraTaal2!E15,IF(cal!$S$7=11,ExtraTaal3!E15,)))))))))))","v":0},{"$f":"IF($S$7=1,NL!F15,IF(cal!$S$7=2,EN!F15,IF(cal!$S$7=3,DE!F15,IF(cal!$S$7=4,FR!F15,IF(cal!$S$7=5,NR!F15,IF(cal!$S$7=6,SP!F15,IF(cal!$S$7=7,SW!F15,IF(cal!$S$7=8,TS!F15,IF(cal!$S$7=9,ExtraTaal1!F15,IF(cal!$S$7=10,ExtraTaal2!F15,IF(cal!$S$7=11,ExtraTaal3!F15,)))))))))))","v":0},{"$f":"IF($S$7=1,NL!G15,IF(cal!$S$7=2,EN!G15,IF(cal!$S$7=3,DE!G15,IF(cal!$S$7=4,FR!G15,IF(cal!$S$7=5,NR!G15,IF(cal!$S$7=6,SP!G15,IF(cal!$S$7=7,SW!G15,IF(cal!$S$7=8,TS!G15,IF(cal!$S$7=9,ExtraTaal1!G15,IF(cal!$S$7=10,ExtraTaal2!G15,IF(cal!$S$7=11,ExtraTaal3!G15,)))))))))))","v":0},{"$f":"IF($S$7=1,NL!H15,IF(cal!$S$7=2,EN!H15,IF(cal!$S$7=3,DE!H15,IF(cal!$S$7=4,FR!H15,IF(cal!$S$7=5,NR!H15,IF(cal!$S$7=6,SP!H15,IF(cal!$S$7=7,SW!H15,IF(cal!$S$7=8,TS!H15,IF(cal!$S$7=9,ExtraTaal1!H15,IF(cal!$S$7=10,ExtraTaal2!H15,IF(cal!$S$7=11,ExtraTaal3!H15,)))))))))))","v":0},{"$f":"IF($S$7=1,NL!I15,IF(cal!$S$7=2,EN!I15,IF(cal!$S$7=3,DE!I15,IF(cal!$S$7=4,FR!I15,IF(cal!$S$7=5,NR!I15,IF(cal!$S$7=6,SP!I15,IF(cal!$S$7=7,SW!I15,IF(cal!$S$7=8,TS!I15,IF(cal!$S$7=9,ExtraTaal1!I15,IF(cal!$S$7=10,ExtraTaal2!I15,IF(cal!$S$7=11,ExtraTaal3!I15,)))))))))))","v":0},{"$f":"IF($S$7=1,NL!J15,IF(cal!$S$7=2,EN!J15,IF(cal!$S$7=3,DE!J15,IF(cal!$S$7=4,FR!J15,IF(cal!$S$7=5,NR!J15,IF(cal!$S$7=6,SP!J15,IF(cal!$S$7=7,SW!J15,IF(cal!$S$7=8,TS!J15,IF(cal!$S$7=9,ExtraTaal1!J15,IF(cal!$S$7=10,ExtraTaal2!J15,IF(cal!$S$7=11,ExtraTaal3!J15,)))))))))))","v":0},{"$f":"IF($S$7=1,NL!K15,IF(cal!$S$7=2,EN!K15,IF(cal!$S$7=3,DE!K15,IF(cal!$S$7=4,FR!K15,IF(cal!$S$7=5,NR!K15,IF(cal!$S$7=6,SP!K15,IF(cal!$S$7=7,SW!K15,IF(cal!$S$7=8,TS!K15,IF(cal!$S$7=9,ExtraTaal1!K15,IF(cal!$S$7=10,ExtraTaal2!K15,IF(cal!$S$7=11,ExtraTaal3!K15,)))))))))))","v":0},{"$f":"IF($S$7=1,NL!L15,IF(cal!$S$7=2,EN!L15,IF(cal!$S$7=3,DE!L15,IF(cal!$S$7=4,FR!L15,IF(cal!$S$7=5,NR!L15,IF(cal!$S$7=6,SP!L15,IF(cal!$S$7=7,SW!L15,IF(cal!$S$7=8,TS!L15,IF(cal!$S$7=9,ExtraTaal1!L15,IF(cal!$S$7=10,ExtraTaal2!L15,IF(cal!$S$7=11,ExtraTaal3!L15,)))))))))))","v":0},{"$f":"IF($S$7=1,NL!M15,IF(cal!$S$7=2,EN!M15,IF(cal!$S$7=3,DE!M15,IF(cal!$S$7=4,FR!M15,IF(cal!$S$7=5,NR!M15,IF(cal!$S$7=6,SP!M15,IF(cal!$S$7=7,SW!M15,IF(cal!$S$7=8,TS!M15,IF(cal!$S$7=9,ExtraTaal1!M15,IF(cal!$S$7=10,ExtraTaal2!M15,IF(cal!$S$7=11,ExtraTaal3!M15,)))))))))))","v":0},{"$f":"IF($S$7=1,NL!N15,IF(cal!$S$7=2,EN!N15,IF(cal!$S$7=3,DE!N15,IF(cal!$S$7=4,FR!N15,IF(cal!$S$7=5,NR!N15,IF(cal!$S$7=6,SP!N15,IF(cal!$S$7=7,SW!N15,IF(cal!$S$7=8,TS!N15,IF(cal!$S$7=9,ExtraTaal1!N15,IF(cal!$S$7=10,ExtraTaal2!N15,IF(cal!$S$7=11,ExtraTaal3!N15,)))))))))))","v":0},{"$f":"IF($S$7=1,NL!O15,IF(cal!$S$7=2,EN!O15,IF(cal!$S$7=3,DE!O15,IF(cal!$S$7=4,FR!O15,IF(cal!$S$7=5,NR!O15,IF(cal!$S$7=6,SP!O15,IF(cal!$S$7=7,SW!O15,IF(cal!$S$7=8,TS!O15,IF(cal!$S$7=9,ExtraTaal1!O15,IF(cal!$S$7=10,ExtraTaal2!O15,IF(cal!$S$7=11,ExtraTaal3!O15,)))))))))))","v":0},"n-value","n-value","n-value","n-value","n-value","n-value",null,{"$f":"IF('Clima Canal'!$K$6=cal!Y2,1,IF('Clima Canal'!$K$6=cal!Y3,2,IF('Clima Canal'!$K$6=cal!Y5,3,IF('Clima Canal'!$K$6=cal!Y6,4,IF('Clima Canal'!$K$6=cal!Y7,5,IF('Clima Canal'!$K$6=cal!Y8,6,IF('Clima Canal'!$K$6=cal!Y4,7,)))))))","v":5},null,null,null,null,null,null,{"$f":"CONCATENATE(\"Clima H\",AF22,\" B\",AH22)","v":"Clima H8 B18"},null,null,null,null,null,null,{"$f":"CONCATENATE(\"Clima H\",AM22,\" B\",AO22)","v":"Clima H10 B18"},null,null,null,null,null,null,null,"voelbare koelcapaciteit","totale koelcapaciteit",null,{"$f":"CONCATENATE(\"Clima H\",AX22,\" B\",AZ22,\" 4P\")","v":"Clima H13 B27 4P"},null,null,null,null,null,null,{"$f":"CONCATENATE(\"Clima H\",BE22,\" B\",BG22,\" 4P\")","v":"Clima H13 B32 4P"},null,null,null,null,null,null,{"$f":"CONCATENATE(\"Clima H\",BL22,\" B\",BN22,\" 2P\")","v":"Clima H13 B32 2P"},null,null,null,null,null,null,null,{"$f":"CONCATENATE(\"Clima H\",BT22,\" B\",BV22,\" 4P\")","v":"Clima H19 B34 4P"},null,null,null,null,null,null,{"$f":"CONCATENATE(\"Clima H\",CA22,\" B\",CC22,\" 2P\")","v":"Clima H19 B34 2P"}]
[null,0.2,2,{"$f":"(X17*($T$11^$Q17))*Watts*CF_Altit","v":1245.4047763416349},{"$f":"ROUND(((D17/Watts)/(($S$9-$S$10)*1.163))*$E$14,IF($X$4=1,0,IF($X$4=2,2)))","v":107},{"$f":"($Y$18*(E17/$E$14)^$Y$20)*$F$14","v":0.31753316413095029},{"$f":"(Z17*($W$11^R17))*Watts*CF_Altit","v":141.38590046883769},{"$f":"((G17/Watts)/(IF((237.3*LN((RH*EXP(17.27*(Tl_cool/(Tl_cool+237.3))))))/(17.27-LN((RH*EXP(17.27*(Tl_cool/(Tl_cool+237.3))))))<Tavg_cold,1,IF(1/(1+((2258*((0.622/(($Z$11/(1*611*EXP(17.27*(Tavg_cold/(Tavg_cold+237.3))))))-1)*1000-(0.622/(($Z$11/(RH*611*EXP(17.27*(Tl_cool/(Tl_cool+237.3))))))-1)*1000))/(1005*(Tavg_cold-Tl_cool))))*1.039+((-0.000729*$C17+0.001448)*(Tl_cool-Tavg_cold)+(0.016908*$C17-0.033574))*1.039>1,1,1/(1+((2258*((0.622/(($Z$11/(1*611*EXP(17.27*(Tavg_cold/(Tavg_cold+237.3))))))-1)*1000-(0.622/(($Z$11/(RH*611*EXP(17.27*(Tl_cool/(Tl_cool+237.3))))))-1)*1000))/(1005*(Tavg_cold-Tl_cool))))*1.039+((-0.000729*$C17+0.001448)*(Tl_cool-Tavg_cold)+(0.016908*$C17-0.033574))*1.039))))*Watts","v":141.38590046883769},{"$f":"ROUND(((H17/Watts)/((Tr_cool-Tv_cool)*1.163))*$I$14,IF($X$4=1,0,IF($X$4=2,2)))","v":41},{"$f":"($AA$18*(I17/$I$14)^$AA$20)*$J$14","v":4.662182277090815E-2},{"$f":"L17-8","v":16.964612482003041},{"$f":"AB17","v":24.964612482003041},1.5,{"$f":"AD17*Cubics","v":97},{"$f":"((($D17/Watts)/(((p_atm*0.028964)/(8.31447*(20+273.15)))*(($N17/3600)/Cubics)*(1005+1870*((0.622)/(((p_atm)/($E$12*Pvs_Heat_in))-1)))))+Tl_heat)*Celc1+Celc2","v":57.68726147902062},{"$f":"(Tl_cool-(($G17/Watts)/(1006*$N17*kgss)))*Celc1+Celc2","v":21.667761066510003},1,{"$f":"IF($X$16=1,S17,IF($X$16=2,S17,IF($X$16=3,U17,IF($X$16=4,U17,IF($X$16=5,V17,IF($X$16=6,V17,IF($X$16=7,T17,)))))))","v":0.87660000000000005},0.6,1.1599999999999999,0.78069999999999995,0.87660000000000005,{"$f":"(H17-G17)/H17","v":0},{"$f":"IF($X$16=1,AE17,IF($X$16=2,AL17,IF($X$16=3,BK17,IF($X$16=4,BD17,IF($X$16=5,BZ17,IF($X$16=6,BS17,IF($X$16=7,AW17,)))))))","v":1245.4047763416349},"a",164.06246461287881,"a",24.964612482003041,1.5,97,276,"a",30,"a",22,0.5,24,{"$f":"AE17","v":276},"a",30,"a",{"$f":"AI17","v":22},{"$f":"AJ17","v":0.5},{"$f":"AK17","v":24},null,{"$f":"(AG17*((((Tv_cool-Tr_cool)/LN((Tv_cool-Tl_cool)/(Tr_cool-Tl_cool)))/((16-18)/LN((16-27)/(18-27))))^S17))*$G$14","v":9.0620574016851627E-3},{"$f":"((AT17/$G$14)/(IF((237.3*LN((RH*EXP(17.27*(Tl_cool/(Tl_cool+237.3))))))/(17.27-LN((RH*EXP(17.27*(Tl_cool/(Tl_cool+237.3))))))<((Tv_cool+Tr_cool)/2),1,1/(1+((2258*((0.622/((p_atm/(1*611*EXP(17.27*(((Tv_cool+Tr_cool)/2)/(((Tv_cool+Tr_cool)/2)+237.3))))))-1)*1000-(0.622/((p_atm/(RH*611*EXP(17.27*(Tl_cool/(Tl_cool+237.3))))))-1)*1000))/(1005*(((Tv_cool+Tr_cool)/2)-Tl_cool))))+-((-0.000625*$C17+0.00625)*(Tl_cool-(Tv_cool+Tr_cool)/2)-(-0.000625*$C17+0.00625)*10))))*$H$14","v":27.095852696068629},null,362,"a",41,"a",24,1,38,268.32763,"a",64.623507787529448,"a",24,0.98399999999999999,35,312.78086398696399,"a",67.306371917380019,"a",{"$f":"BH17","v":24},{"$f":"BI17","v":0.98399999999999999},35,null,830.26985089442314,"a",149.14769510261706,"a",24.964612482003041,1.5,97,1245.4047763416349,"a",164.06246461287881,"a",24.964612482003041,1.5,97]
[null,0.4,4,{"$f":"(X18*($T$11^$Q18))*Watts*CF_Altit","v":1965.4500742286991},{"$f":"ROUND(((D18/Watts)/(($S$9-$S$10)*1.163))*$E$14,IF($X$4=1,0,IF($X$4=2,2)))","v":169},{"$f":"($Y$18*(E18/$E$14)^$Y$20)*$F$14","v":0.79212723388453754},{"$f":"(Z18*($W$11^R18))*Watts*CF_Altit","v":276.19352473343014},{"$f":"((G18/Watts)/(IF((237.3*LN((RH*EXP(17.27*(Tl_cool/(Tl_cool+237.3))))))/(17.27-LN((RH*EXP(17.27*(Tl_cool/(Tl_cool+237.3))))))<Tavg_cold,1,IF(1/(1+((2258*((0.622/(($Z$11/(1*611*EXP(17.27*(Tavg_cold/(Tavg_cold+237.3))))))-1)*1000-(0.622/(($Z$11/(RH*611*EXP(17.27*(Tl_cool/(Tl_cool+237.3))))))-1)*1000))/(1005*(Tavg_cold-Tl_cool))))*1.039+((-0.000729*$C18+0.001448)*(Tl_cool-Tavg_cold)+(0.016908*$C18-0.033574))*1.039>1,1,1/(1+((2258*((0.622/(($Z$11/(1*611*EXP(17.27*(Tavg_cold/(Tavg_cold+237.3))))))-1)*1000-(0.622/(($Z$11/(RH*611*EXP(17.27*(Tl_cool/(Tl_cool+237.3))))))-1)*1000))/(1005*(Tavg_cold-Tl_cool))))*1.039+((-0.000729*$C18+0.001448)*(Tl_cool-Tavg_cold)+(0.016908*$C18-0.033574))*1.039))))*Watts","v":276.19352473343014},{"$f":"ROUND(((H18/Watts)/((Tr_cool-Tv_cool)*1.163))*$I$14,IF($X$4=1,0,IF($X$4=2,2)))","v":79},{"$f":"($AA$18*(I18/$I$14)^$AA$20)*$J$14","v":0.17309149072768457},{"$f":"L18-8","v":21.008364373401289},29.008364373401289,2.7,{"$f":"AD18*Cubics","v":167},{"$f":"((($D18/Watts)/(((p_atm*0.028964)/(8.31447*(20+273.15)))*(($N18/3600)/Cubics)*(1005+1870*((0.622)/(((p_atm)/($E$12*Pvs_Heat_in))-1)))))+Tl_heat)*Celc1+Celc2","v":54.546283562874855},{"$f":"(Tl_cool-(($G18/Watts)/(1006*$N18*kgss)))*Celc1+Celc2","v":21.084416763981583},1,{"$f":"IF($X$16=1,S18,IF($X$16=2,S18,IF($X$16=3,U18,IF($X$16=4,U18,IF($X$16=5,V18,IF($X$16=6,V18,IF($X$16=7,T18,)))))))","v":0.87749999999999995},0.68,1.04,0.85870000000000002,0.87749999999999995,{"$f":"(H18-G18)/H18","v":0},1965.4500742286991,2.7734576306310619E-5,320.54052904133164,2.7734576306310619E-5,29.008364373401289,2.7,167,496,2.5649818987149339E-4,66,{"$f":"AF18","v":2.5649818987149339E-4},23,0.8,37,{"$f":"AE18","v":496},{"$f":"AH18","v":2.5649818987149339E-4},66,{"$f":"AM18","v":2.5649818987149339E-4},{"$f":"AI18","v":23},0.8,37,null,{"$f":"(AG18*((((Tv_cool-Tr_cool)/LN((Tv_cool-Tl_cool)/(Tr_cool-Tl_cool)))/((16-18)/LN((16-27)/(18-27))))^S18))*$G$14","v":1.9667705592505875E-2},{"$f":"((AT18/$G$14)/(IF((237.3*LN((RH*EXP(17.27*(Tl_cool/(Tl_cool+237.3))))))/(17.27-LN((RH*EXP(17.27*(Tl_cool/(Tl_cool+237.3))))))<((Tv_cool+Tr_cool)/2),1,1/(1+((2258*((0.622/((p_atm/(1*611*EXP(17.27*(((Tv_cool+Tr_cool)/2)/(((Tv_cool+Tr_cool)/2)+237.3))))))-1)*1000-(0.622/((p_atm/(RH*611*EXP(17.27*(Tl_cool/(Tl_cool+237.3))))))-1)*1000))/(1005*(((Tv_cool+Tr_cool)/2)-Tl_cool))))+-((-0.000625*$C18+0.00625)*(Tl_cool-(Tv_cool+Tr_cool)/2)-(-0.000625*$C18+0.00625)*10))))*$H$14","v":58.807093133738569},null,590,2.55E-5,84,5.8081200000000001E-6,27,1.6,55,535.13636999999994,2.9298500000000001E-5,117.3585340330626,1.1996876822122094E-5,27,1.6320000000000001,44,691.76841147721154,2.0144747035437757E-5,122.21148525330661,{"$f":"BL18","v":2.0144747035437757E-5},{"$f":"BH18","v":27},1.6320000000000001,44,null,1310.3000494857993,2.2035480565662373E-5,291.40048094666514,6.6066314442915391E-5,29.008364373401289,2.7,167,1965.4500742286991,2.7734576306310619E-5,320.54052904133164,2.7734576306310619E-5,29.008364373401289,2.7,167]
[null,0.6,6,{"$f":"(X19*($T$11^$Q19))*Watts*CF_Altit","v":2566.6887513844108},{"$f":"ROUND(((D19/Watts)/(($S$9-$S$10)*1.163))*$E$14,IF($X$4=1,0,IF($X$4=2,2)))","v":221},{"$f":"($Y$18*(E19/$E$14)^$Y$20)*$F$14","v":1.3545844413765169},{"$f":"(Z19*($W$11^R19))*Watts*CF_Altit","v":408.34954092992461},{"$f":"((G19/Watts)/(IF((237.3*LN((RH*EXP(17.27*(Tl_cool/(Tl_cool+237.3))))))/(17.27-LN((RH*EXP(17.27*(Tl_cool/(Tl_cool+237.3))))))<Tavg_cold,1,IF(1/(1+((2258*((0.622/(($Z$11/(1*611*EXP(17.27*(Tavg_cold/(Tavg_cold+237.3))))))-1)*1000-(0.622/(($Z$11/(RH*611*EXP(17.27*(Tl_cool/(Tl_cool+237.3))))))-1)*1000))/(1005*(Tavg_cold-Tl_cool))))*1.039+((-0.000729*$C19+0.001448)*(Tl_cool-Tavg_cold)+(0.016908*$C19-0.033574))*1.039>1,1,1/(1+((2258*((0.622/(($Z$11/(1*611*EXP(17.27*(Tavg_cold/(Tavg_cold+237.3))))))-1)*1000-(0.622/(($Z$11/(RH*611*EXP(17.27*(Tl_cool/(Tl_cool+237.3))))))-1)*1000))/(1005*(Tavg_cold-Tl_cool))))*1.039+((-0.000729*$C19+0.001448)*(Tl_cool-Tavg_cold)+(0.016908*$C19-0.033574))*1.039))))*Watts","v":408.34954092992461},{"$f":"ROUND(((H19/Watts)/((Tr_cool-Tv_cool)*1.163))*$I$14,IF($X$4=1,0,IF($X$4=2,2)))","v":117},{"$f":"($AA$18*(I19/$I$14)^$AA$20)*$J$14","v":0.37965861505708604},{"$f":"L19-8","v":26.993900782441038},34.993900782441038,4.8,{"$f":"AD19*Cubics","v":236},{"$f":"((($D19/Watts)/(((p_atm*0.028964)/(8.31447*(20+273.15)))*(($N19/3600)/Cubics)*(1005+1870*((0.622)/(((p_atm)/($E$12*Pvs_Heat_in))-1)))))+Tl_heat)*Celc1+Celc2","v":51.923977237265561},{"$f":"(Tl_cool-(($G19/Watts)/(1006*$N19*kgss)))*Celc1+Celc2","v":20.857218157957309},1,0.88200000000000001,0.79,0.95,0.8831,0.88200000000000001,{"$f":"(H19-G19)/H19","v":0},{"$f":"IF($X$16=1,AE19,IF($X$16=2,AL19,IF($X$16=3,BK19,IF($X$16=4,BD19,IF($X$16=5,BZ19,IF($X$16=6,BS19,IF($X$16=7,AW19,)))))))","v":2566.6887513844108},"b",474.27820425144279,"b",34.993900782441038,4.8,236,699,"b",104,"b",31,1.3,52,{"$f":"AE19","v":699},"b",104,"b",31,1.3,52,null,{"$f":"(AG19*((((Tv_cool-Tr_cool)/LN((Tv_cool-Tl_cool)/(Tr_cool-Tl_cool)))/((16-18)/LN((16-27)/(18-27))))^S19))*$G$14","v":3.041840163523904E-2},{"$f":"((AT19/$G$14)/(IF((237.3*LN((RH*EXP(17.27*(Tl_cool/(Tl_cool+237.3))))))/(17.27-LN((RH*EXP(17.27*(Tl_cool/(Tl_cool+237.3))))))<((Tv_cool+Tr_cool)/2),1,1/(1+((2258*((0.622/((p_atm/(1*611*EXP(17.27*(((Tv_cool+Tr_cool)/2)/(((Tv_cool+Tr_cool)/2)+237.3))))))-1)*1000-(0.622/((p_atm/(RH*611*EXP(17.27*(Tl_cool/(Tl_cool+237.3))))))-1)*1000))/(1005*(((Tv_cool+Tr_cool)/2)-Tl_cool))))+-((-0.000625*$C19+0.00625)*(Tl_cool-(Tv_cool+Tr_cool)/2)-(-0.000625*$C19+0.00625)*10))))*$H$14","v":90.952031467492262},null,786,"b",127,"b",35.1,2.9,85,754.79587000000004,"b",168.71575127942032,"b",35,3.2,85,1031.2359042995408,"b",174.53607497828463,"b",{"$f":"BH19","v":35},3.2,85,null,1711.1258342562737,"b",431.16200386494791,"b",34.993900782441038,4.8,236,2566.6887513844108,"b",474.27820425144279,"b",34.993900782441038,4.8,236]
[null,0.8,8,{"$f":"(X20*($T$11^$Q20))*Watts*CF_Altit","v":3101.7979597228677},{"$f":"ROUND(((D20/Watts)/(($S$9-$S$10)*1.163))*$E$14,IF($X$4=1,0,IF($X$4=2,2)))","v":267},{"$f":"($Y$18*(E20/$E$14)^$Y$20)*$F$14","v":1.9771702103005777},{"$f":"(Z20*($W$11^R20))*Watts*CF_Altit","v":538.01886773932847},{"$f":"((G20/Watts)/(IF((237.3*LN((RH*EXP(17.27*(Tl_cool/(Tl_cool+237.3))))))/(17.27-LN((RH*EXP(17.27*(Tl_cool/(Tl_cool+237.3))))))<Tavg_cold,1,IF(1/(1+((2258*((0.622/(($Z$11/(1*611*EXP(17.27*(Tavg_cold/(Tavg_cold+237.3))))))-1)*1000-(0.622/(($Z$11/(RH*611*EXP(17.27*(Tl_cool/(Tl_cool+237.3))))))-1)*1000))/(1005*(Tavg_cold-Tl_cool))))*1.039+((-0.000729*$C20+0.001448)*(Tl_cool-Tavg_cold)+(0.016908*$C20-0.033574))*1.039>1,1,1/(1+((2258*((0.622/(($Z$11/(1*611*EXP(17.27*(Tavg_cold/(Tavg_cold+237.3))))))-1)*1000-(0.622/(($Z$11/(RH*611*EXP(17.27*(Tl_cool/(Tl_cool+237.3))))))-1)*1000))/(1005*(Tavg_cold-Tl_cool))))*1.039+((-0.000729*$C20+0.001448)*(Tl_cool-Tavg_cold)+(0.016908*$C20-0.033574))*1.039))))*Watts","v":538.01886773932847},{"$f":"ROUND(((H20/Watts)/((Tr_cool-Tv_cool)*1.163))*$I$14,IF($X$4=1,0,IF($X$4=2,2)))","v":154},{"$f":"($AA$18*(I20/$I$14)^$AA$20)*$J$14","v":0.65775321168046263},{"$f":"L20-8","v":34.99363224187082},42.99363224187082,9.3000000000000007,{"$f":"AD20*Cubics","v":309},{"$f":"((($D20/Watts)/(((p_atm*0.028964)/(8.31447*(20+273.15)))*(($N20/3600)/Cubics)*(1005+1870*((0.622)/(((p_atm)/($E$12*Pvs_Heat_in))-1)))))+Tl_heat)*Celc1+Celc2","v":49.465296437176931},{"$f":"(Tl_cool-(($G20/Watts)/(1006*$N20*kgss)))*Celc1+Celc2","v":20.824920094573073},1,0.89500000000000002,0.87,0.95,0.85389999999999999,0.89500000000000002,{"$f":"(H20-G20)/H20","v":0},3101.7979597228677,2,626.26287493934944,2,42.99363224187082,9.3000000000000007,309,891,1.8235155847906248,144,{"$f":"AF20","v":1.8235155847906248},36,2.1,68,{"$f":"AE20","v":891},{"$f":"AH20","v":1.8235155847906248},144,{"$f":"AM20","v":1.8235155847906248},36,2.1,68,null,{"$f":"(AG20*((((Tv_cool-Tr_cool)/LN((Tv_cool-Tl_cool)/(Tr_cool-Tl_cool)))/((16-18)/LN((16-27)/(18-27))))^S20))*$G$14","v":4.1549877885802243E-2},{"$f":"((AT20/$G$14)/(IF((237.3*LN((RH*EXP(17.27*(Tl_cool/(Tl_cool+237.3))))))/(17.27-LN((RH*EXP(17.27*(Tl_cool/(Tl_cool+237.3))))))<((Tv_cool+Tr_cool)/2),1,1/(1+((2258*((0.622/((p_atm/(1*611*EXP(17.27*(((Tv_cool+Tr_cool)/2)/(((Tv_cool+Tr_cool)/2)+237.3))))))-1)*1000-(0.622/((p_atm/(RH*611*EXP(17.27*(Tl_cool/(Tl_cool+237.3))))))-1)*1000))/(1005*(((Tv_cool+Tr_cool)/2)-Tl_cool))))+-((-0.000625*$C20+0.00625)*(Tl_cool-(Tv_cool+Tr_cool)/2)-(-0.000625*$C20+0.00625)*10))))*$H$14","v":124.23551527316302},null,962,1.8,170,2,43,5,117,927.30612999999994,1.91852,218.69515952660262,1.9520723695113043,43,5.9,117,1331.183342453952,1.9213049050521955,224.28014109231404,{"$f":"BL20","v":1.9213049050521955},{"$f":"BH20","v":43},5.9,117,null,2067.8653064819118,2,569.32988630849945,2,42.99363224187082,9.3000000000000007,309,3101.7979597228677,2,626.26287493934944,2,42.99363224187082,9.3000000000000007,309]
[null,1,10,{"$f":"(X21*($T$11^$Q21))*Watts*CF_Altit","v":3592.5600611198183},{"$f":"ROUND(((D21/Watts)/(($S$9-$S$10)*1.163))*$E$14,IF($X$4=1,0,IF($X$4=2,2)))","v":309},{"$f":"($Y$18*(E21/$E$14)^$Y$20)*$F$14","v":2.6481250803028442},{"$f":"(Z21*($W$11^R21))*Watts*CF_Altit","v":665.65837447413628},{"$f":"((G21/Watts)/(IF((237.3*LN((RH*EXP(17.27*(Tl_cool/(Tl_cool+237.3))))))/(17.27-LN((RH*EXP(17.27*(Tl_cool/(Tl_cool+237.3))))))<Tavg_cold,1,IF(1/(1+((2258*((0.622/(($Z$11/(1*611*EXP(17.27*(Tavg_cold/(Tavg_cold+237.3))))))-1)*1000-(0.622/(($Z$11/(RH*611*EXP(17.27*(Tl_cool/(Tl_cool+237.3))))))-1)*1000))/(1005*(Tavg_cold-Tl_cool))))*1.039+((-0.000729*$C21+0.001448)*(Tl_cool-Tavg_cold)+(0.016908*$C21-0.033574))*1.039>1,1,1/(1+((2258*((0.622/(($Z$11/(1*611*EXP(17.27*(Tavg_cold/(Tavg_cold+237.3))))))-1)*1000-(0.622/(($Z$11/(RH*611*EXP(17.27*(Tl_cool/(Tl_cool+237.3))))))-1)*1000))/(1005*(Tavg_cold-Tl_cool))))*1.039+((-0.000729*$C21+0.001448)*(Tl_cool-Tavg_cold)+(0.016908*$C21-0.033574))*1.039))))*Watts","v":665.65837447413628},{"$f":"ROUND(((H21/Watts)/((Tr_cool-Tv_cool)*1.163))*$I$14,IF($X$4=1,0,IF($X$4=2,2)))","v":191},{"$f":"($AA$18*(I21/$I$14)^$AA$20)*$J$14","v":1.0117850782305178},{"$f":"L21-8","v":39.999307043688582},47.999307043688582,15,{"$f":"AD21*Cubics","v":351},{"$f":"((($D21/Watts)/(((p_atm*0.028964)/(8.31447*(20+273.15)))*(($N21/3600)/Cubics)*(1005+1870*((0.622)/(((p_atm)/($E$12*Pvs_Heat_in))-1)))))+Tl_heat)*Celc1+Celc2","v":50.043651054078737},{"$f":"(Tl_cool-(($G21/Watts)/(1006*$N21*kgss)))*Celc1+Celc2","v":20.363333801822023},1,0.91110000000000002,0.91,0.98,0.77110000000000001,0.91110000000000002,{"$f":"(H21-G21)/H21","v":0},3592.5600611198183,0,776.95718857661211,0,47.999307043688582,15,351,1075,null,185,null,42,3,79,{"$f":"AE21","v":1075},null,185,null,42,3,79,null,{"$f":"(AG21*((((Tv_cool-Tr_cool)/LN((Tv_cool-Tl_cool)/(Tr_cool-Tl_cool)))/((16-18)/LN((16-27)/(18-27))))^S21))*$G$14","v":5.301894633339712E-2},{"$f":"((AT21/$G$14)/(IF((237.3*LN((RH*EXP(17.27*(Tl_cool/(Tl_cool+237.3))))))/(17.27-LN((RH*EXP(17.27*(Tl_cool/(Tl_cool+237.3))))))<((Tv_cool+Tr_cool)/2),1,1/(1+((2258*((0.622/((p_atm/(1*611*EXP(17.27*(((Tv_cool+Tr_cool)/2)/(((Tv_cool+Tr_cool)/2)+237.3))))))-1)*1000-(0.622/((p_atm/(RH*611*EXP(17.27*(Tl_cool/(Tl_cool+237.3))))))-1)*1000))/(1005*(((Tv_cool+Tr_cool)/2)-Tl_cool))))+-((-0.000625*$C21+0.00625)*(Tl_cool-(Tv_cool+Tr_cool)/2)-(-0.000625*$C21+0.00625)*10))))*$H$14","v":158.52841096364608},null,1126,null,214,null,46,7.7,147,1052.6671499999998,null,267.29675877460949,null,46,8.8000000000000007,137,1591.6107259404453,null,271.44368359539482,null,{"$f":"BH21","v":46},8.8000000000000007,137,null,2395.0400407465454,null,706.32471688782903,null,47.999307043688582,15,351,3592.5600611198183,null,776.95718857661211,null,47.999307043688582,15,351]
[null,{"$f":"IF($S$7=1,NL!A21,IF(cal!$S$7=2,EN!A21,IF(cal!$S$7=3,DE!A21,IF(cal!$S$7=4,FR!A21,IF(cal!$S$7=5,NR!A21,IF(cal!$S$7=6,SP!A21,IF(cal!$S$7=7,SW!A21,IF(cal!$S$7=8,TS!A21,IF(cal!$S$7=9,ExtraTaal1!A21,IF(cal!$S$7=10,ExtraTaal2!A21,IF(cal!$S$7=11,ExtraTaal3!A21,)))))))))))","v":"Clima Canal altura 19 cm ancho 34 cm longitud 120 cm (Type 2)"},{"$f":"IF($S$7=1,NL!B21,IF(cal!$S$7=2,EN!B21,IF(cal!$S$7=3,DE!B21,IF(cal!$S$7=4,FR!B21,IF(cal!$S$7=5,NR!B21,IF(cal!$S$7=6,SP!B21,IF(cal!$S$7=7,SW!B21,IF(cal!$S$7=8,TS!B21,IF(cal!$S$7=9,ExtraTaal1!B21,IF(cal!$S$7=10,ExtraTaal2!B21,IF(cal!$S$7=11,ExtraTaal3!B21,)))))))))))","v":0},{"$f":"IF($S$7=1,NL!C21,IF(cal!$S$7=2,EN!C21,IF(cal!$S$7=3,DE!C21,IF(cal!$S$7=4,FR!C21,IF(cal!$S$7=5,NR!C21,IF(cal!$S$7=6,SP!C21,IF(cal!$S$7=7,SW!C21,IF(cal!$S$7=8,TS!C21,IF(cal!$S$7=9,ExtraTaal1!C21,IF(cal!$S$7=10,ExtraTaal2!C21,IF(cal!$S$7=11,ExtraTaal3!C21,)))))))))))","v":0},{"$f":"IF($S$7=1,NL!D21,IF(cal!$S$7=2,EN!D21,IF(cal!$S$7=3,DE!D21,IF(cal!$S$7=4,FR!D21,IF(cal!$S$7=5,NR!D21,IF(cal!$S$7=6,SP!D21,IF(cal!$S$7=7,SW!D21,IF(cal!$S$7=8,TS!D21,IF(cal!$S$7=9,ExtraTaal1!D21,IF(cal!$S$7=10,ExtraTaal2!D21,IF(cal!$S$7=11,ExtraTaal3!D21,)))))))))))","v":0},{"$f":"IF($S$7=1,NL!E21,IF(cal!$S$7=2,EN!E21,IF(cal!$S$7=3,DE!E21,IF(cal!$S$7=4,FR!E21,IF(cal!$S$7=5,NR!E21,IF(cal!$S$7=6,SP!E21,IF(cal!$S$7=7,SW!E21,IF(cal!$S$7=8,TS!E21,IF(cal!$S$7=9,ExtraTaal1!E21,IF(cal!$S$7=10,ExtraTaal2!E21,IF(cal!$S$7=11,ExtraTaal3!E21,)))))))))))","v":0},{"$f":"IF($S$7=1,NL!F21,IF(cal!$S$7=2,EN!F21,IF(cal!$S$7=3,DE!F21,IF(cal!$S$7=4,FR!F21,IF(cal!$S$7=5,NR!F21,IF(cal!$S$7=6,SP!F21,IF(cal!$S$7=7,SW!F21,IF(cal!$S$7=8,TS!F21,IF(cal!$S$7=9,ExtraTaal1!F21,IF(cal!$S$7=10,ExtraTaal2!F21,IF(cal!$S$7=11,ExtraTaal3!F21,)))))))))))","v":0},{"$f":"IF($S$7=1,NL!G21,IF(cal!$S$7=2,EN!G21,IF(cal!$S$7=3,DE!G21,IF(cal!$S$7=4,FR!G21,IF(cal!$S$7=5,NR!G21,IF(cal!$S$7=6,SP!G21,IF(cal!$S$7=7,SW!G21,IF(cal!$S$7=8,TS!G21,IF(cal!$S$7=9,ExtraTaal1!G21,IF(cal!$S$7=10,ExtraTaal2!G21,IF(cal!$S$7=11,ExtraTaal3!G21,)))))))))))","v":0},{"$f":"IF($S$7=1,NL!H21,IF(cal!$S$7=2,EN!H21,IF(cal!$S$7=3,DE!H21,IF(cal!$S$7=4,FR!H21,IF(cal!$S$7=5,NR!H21,IF(cal!$S$7=6,SP!H21,IF(cal!$S$7=7,SW!H21,IF(cal!$S$7=8,TS!H21,IF(cal!$S$7=9,ExtraTaal1!H21,IF(cal!$S$7=10,ExtraTaal2!H21,IF(cal!$S$7=11,ExtraTaal3!H21,)))))))))))","v":0},{"$f":"IF($S$7=1,NL!I21,IF(cal!$S$7=2,EN!I21,IF(cal!$S$7=3,DE!I21,IF(cal!$S$7=4,FR!I21,IF(cal!$S$7=5,NR!I21,IF(cal!$S$7=6,SP!I21,IF(cal!$S$7=7,SW!I21,IF(cal!$S$7=8,TS!I21,IF(cal!$S$7=9,ExtraTaal1!I21,IF(cal!$S$7=10,ExtraTaal2!I21,IF(cal!$S$7=11,ExtraTaal3!I21,)))))))))))","v":0},{"$f":"IF($S$7=1,NL!J21,IF(cal!$S$7=2,EN!J21,IF(cal!$S$7=3,DE!J21,IF(cal!$S$7=4,FR!J21,IF(cal!$S$7=5,NR!J21,IF(cal!$S$7=6,SP!J21,IF(cal!$S$7=7,SW!J21,IF(cal!$S$7=8,TS!J21,IF(cal!$S$7=9,ExtraTaal1!J21,IF(cal!$S$7=10,ExtraTaal2!J21,IF(cal!$S$7=11,ExtraTaal3!J21,)))))))))))","v":0},{"$f":"IF($S$7=1,NL!K21,IF(cal!$S$7=2,EN!K21,IF(cal!$S$7=3,DE!K21,IF(cal!$S$7=4,FR!K21,IF(cal!$S$7=5,NR!K21,IF(cal!$S$7=6,SP!K21,IF(cal!$S$7=7,SW!K21,IF(cal!$S$7=8,TS!K21,IF(cal!$S$7=9,ExtraTaal1!K21,IF(cal!$S$7=10,ExtraTaal2!K21,IF(cal!$S$7=11,ExtraTaal3!K21,)))))))))))","v":0},{"$f":"IF($S$7=1,NL!L21,IF(cal!$S$7=2,EN!L21,IF(cal!$S$7=3,DE!L21,IF(cal!$S$7=4,FR!L21,IF(cal!$S$7=5,NR!L21,IF(cal!$S$7=6,SP!L21,IF(cal!$S$7=7,SW!L21,IF(cal!$S$7=8,TS!L21,IF(cal!$S$7=9,ExtraTaal1!L21,IF(cal!$S$7=10,ExtraTaal2!L21,IF(cal!$S$7=11,ExtraTaal3!L21,)))))))))))","v":0},{"$f":"IF($S$7=1,NL!M21,IF(cal!$S$7=2,EN!M21,IF(cal!$S$7=3,DE!M21,IF(cal!$S$7=4,FR!M21,IF(cal!$S$7=5,NR!M21,IF(cal!$S$7=6,SP!M21,IF(cal!$S$7=7,SW!M21,IF(cal!$S$7=8,TS!M21,IF(cal!$S$7=9,ExtraTaal1!M21,IF(cal!$S$7=10,ExtraTaal2!M21,IF(cal!$S$7=11,ExtraTaal3!M21,)))))))))))","v":0},{"$f":"IF($S$7=1,NL!N21,IF(cal!$S$7=2,EN!N21,IF(cal!$S$7=3,DE!N21,IF(cal!$S$7=4,FR!N21,IF(cal!$S$7=5,NR!N21,IF(cal!$S$7=6,SP!N21,IF(cal!$S$7=7,SW!N21,IF(cal!$S$7=8,TS!N21,IF(cal!$S$7=9,ExtraTaal1!N21,IF(cal!$S$7=10,ExtraTaal2!N21,IF(cal!$S$7=11,ExtraTaal3!N21,)))))))))))","v":0},{"$f":"IF($S$7=1,NL!O21,IF(cal!$S$7=2,EN!O21,IF(cal!$S$7=3,DE!O21,IF(cal!$S$7=4,FR!O21,IF(cal!$S$7=5,NR!O21,IF(cal!$S$7=6,SP!O21,IF(cal!$S$7=7,SW!O21,IF(cal!$S$7=8,TS!O21,IF(cal!$S$7=9,ExtraTaal1!O21,IF(cal!$S$7=10,ExtraTaal2!O21,IF(cal!$S$7=11,ExtraTaal3!O21,)))))))))))","v":0},"n-value","n-value","n-value","n-value","n-value","n-value",null,"H",19,"B",34,"L",105,0,"H",{"$f":"ROUND(8*IF($X$4=1,1,IF($X$4=2,1/2.54)),1)","v":8},"B",{"$f":"ROUND(18*IF($X$4=1,1,IF($X$4=2,1/2.54)),1)","v":18},"L",{"$f":"72*IF($X$4=1,1,IF($X$4=2,1/2.54))","v":72},null,"H",{"$f":"ROUND(10*IF($X$4=1,1,IF($X$4=2,1/2.54)),1)","v":10},"B",{"$f":"AH22","v":18},"L",{"$f":"AJ22","v":72},null,null,null,null,null,"H",{"$f":"ROUND(IF($X$4=1,13,13/2.54),1)","v":13},"B",{"$f":"ROUND(IF($X$4=1,27,27/2.54),1)","v":27},"L",{"$f":"IF($X$4=1,79.8,79.8/2.54)","v":79.8},null,"H",{"$f":"ROUND(IF($X$4=1,13,13/2.54),1)","v":13},"B",{"$f":"ROUND(IF($X$4=1,32,32/2.54),1)","v":32},"L",{"$f":"IF($X$4=1,70,70/2.54)","v":70},null,"H",{"$f":"ROUND(IF($X$4=1,13,13/2.54),1)","v":13},"B",{"$f":"ROUND(IF($X$4=1,32,32/2.54),1)","v":32},"L",{"$f":"IF($X$4=1,70,70/2.54)","v":70},null,null,"H",{"$f":"ROUND(19*IF($X$4=1,1,IF($X$4=2,1/2.54)),1)","v":19},"B",{"$f":"ROUND(34*IF($X$4=1,1,IF($X$4=2,1/2.54)),1)","v":34},"L",{"$f":"105*IF($X$4=1,1,IF($X$4=2,1/2.54))","v":105},null,"H",{"$f":"BT22","v":19},"B",{"$f":"BV22","v":34},"L",{"$f":"BX22","v":105}]
[null,0.2,2,{"$f":"(X23*($T$11^$Q23))*Watts*CF_Altit","v":1547.5443966375344},{"$f":"ROUND(((D23/Watts)/(($S$9-$S$10)*1.163))*$E$14,IF($X$4=1,0,IF($X$4=2,2)))","v":133},{"$f":"($Y$24*(E23/$E$14)^$Y$26)*$F$14","v":0.50903891846260307},{"$f":"(Z23*($W$11^R23))*Watts*CF_Altit","v":175.68662188435451},{"$f":"((G23/Watts)/(IF((237.3*LN((RH*EXP(17.27*(Tl_cool/(Tl_cool+237.3))))))/(17.27-LN((RH*EXP(17.27*(Tl_cool/(Tl_cool+237.3))))))<Tavg_cold,1,IF(1/(1+((2258*((0.622/(($Z$11/(1*611*EXP(17.27*(Tavg_cold/(Tavg_cold+237.3))))))-1)*1000-(0.622/(($Z$11/(RH*611*EXP(17.27*(Tl_cool/(Tl_cool+237.3))))))-1)*1000))/(1005*(Tavg_cold-Tl_cool))))*1.039+((-0.000729*$C23+0.001448)*(Tl_cool-Tavg_cold)+(0.016908*$C23-0.033574))*1.039>1,1,1/(1+((2258*((0.622/(($Z$11/(1*611*EXP(17.27*(Tavg_cold/(Tavg_cold+237.3))))))-1)*1000-(0.622/(($Z$11/(RH*611*EXP(17.27*(Tl_cool/(Tl_cool+237.3))))))-1)*1000))/(1005*(Tavg_cold-Tl_cool))))*1.039+((-0.000729*$C23+0.001448)*(Tl_cool-Tavg_cold)+(0.016908*$C23-0.033574))*1.039))))*Watts","v":175.68662188435451},{"$f":"ROUND(((H23/Watts)/((Tr_cool-Tv_cool)*1.163))*$I$14,IF($X$4=1,0,IF($X$4=2,2)))","v":50},{"$f":"($AA$24*(I23/$I$14)^$AA$26)*$J$14","v":7.1942862578806471E-2},{"$f":"L23-8","v":18.98962805075108},{"$f":"AB23","v":26.98962805075108},3.2,{"$f":"AD23*Cubics","v":82},{"$f":"((($D23/Watts)/(((p_atm*0.028964)/(8.31447*(20+273.15)))*(($N23/3600)/Cubics)*(1005+1870*((0.622)/(((p_atm)/($E$12*Pvs_Heat_in))-1)))))+Tl_heat)*Celc1+Celc2","v":75.396847765020198},{"$f":"(Tl_cool-(($G23/Watts)/(1006*$N23*kgss)))*Celc1+Celc2","v":19.632002664512108},1,0.87660000000000005,0.6,1.1599999999999999,0.78069999999999995,0.87660000000000005,{"$f":"(H23-G23)/H23","v":0},{"$f":"IF($X$16=1,AE23,IF($X$16=2,AL23,IF($X$16=3,BK23,IF($X$16=4,BD23,IF($X$16=5,BZ23,IF($X$16=6,BS23,IF($X$16=7,AW23,)))))))","v":1547.5443966375344},"a",203.86460099825175,"a",26.98962805075108,3.2,82,569,"a",62,"a",23,0.6,42,{"$f":"AE23","v":569},"a",62,"a",{"$f":"AI23","v":23},0.6,42,null,{"$f":"(AG23*((((Tv_cool-Tr_cool)/LN((Tv_cool-Tl_cool)/(Tr_cool-Tl_cool)))/((16-18)/LN((16-27)/(18-27))))^S23))*$G$14","v":1.8728251963482666E-2},{"$f":"((AT23/$G$14)/(IF((237.3*LN((RH*EXP(17.27*(Tl_cool/(Tl_cool+237.3))))))/(17.27-LN((RH*EXP(17.27*(Tl_cool/(Tl_cool+237.3))))))<((Tv_cool+Tr_cool)/2),1,1/(1+((2258*((0.622/((p_atm/(1*611*EXP(17.27*(((Tv_cool+Tr_cool)/2)/(((Tv_cool+Tr_cool)/2)+237.3))))))-1)*1000-(0.622/((p_atm/(RH*611*EXP(17.27*(Tl_cool/(Tl_cool+237.3))))))-1)*1000))/(1005*(((Tv_cool+Tr_cool)/2)-Tl_cool))))+-((-0.000625*$C23+0.00625)*(Tl_cool-(Tv_cool+Tr_cool)/2)-(-0.000625*$C23+0.00625)*10))))*$H$14","v":55.998095571875155},null,622,"a",71,"a",27,1,52,508.62102999999996,"a",122.49530580621254,"a",28,1.008,44,592.88313024394665,"a",127.58073482846659,"a",{"$f":"BH23","v":28},1.008,44,null,1031.6962644250227,"a",185.33145545295611,"a",26.98962805075108,3.2,82,1547.5443966375344,"a",203.86460099825175,"a",26.98962805075108,3.2,82]
[null,0.4,4,{"$f":"(X24*($T$11^$Q24))*Watts*CF_Altit","v":2442.275240165839},{"$f":"ROUND(((D24/Watts)/(($S$9-$S$10)*1.163))*$E$14,IF($X$4=1,0,IF($X$4=2,2)))","v":210},{"$f":"($Y$24*(E24/$E$14)^$Y$26)*$F$14","v":1.269072095890146},{"$f":"(Z24*($W$11^R24))*Watts*CF_Altit","v":343.19905440248721},{"$f":"((G24/Watts)/(IF((237.3*LN((RH*EXP(17.27*(Tl_cool/(Tl_cool+237.3))))))/(17.27-LN((RH*EXP(17.27*(Tl_cool/(Tl_cool+237.3))))))<Tavg_cold,1,IF(1/(1+((2258*((0.622/(($Z$11/(1*611*EXP(17.27*(Tavg_cold/(Tavg_cold+237.3))))))-1)*1000-(0.622/(($Z$11/(RH*611*EXP(17.27*(Tl_cool/(Tl_cool+237.3))))))-1)*1000))/(1005*(Tavg_cold-Tl_cool))))*1.039+((-0.000729*$C24+0.001448)*(Tl_cool-Tavg_cold)+(0.016908*$C24-0.033574))*1.039>1,1,1/(1+((2258*((0.622/(($Z$11/(1*611*EXP(17.27*(Tavg_cold/(Tavg_cold+237.3))))))-1)*1000-(0.622/(($Z$11/(RH*611*EXP(17.27*(Tl_cool/(Tl_cool+237.3))))))-1)*1000))/(1005*(Tavg_cold-Tl_cool))))*1.039+((-0.000729*$C24+0.001448)*(Tl_cool-Tavg_cold)+(0.016908*$C24-0.033574))*1.039))))*Watts","v":343.19905440248721},{"$f":"ROUND(((H24/Watts)/((Tr_cool-Tv_cool)*1.163))*$I$14,IF($X$4=1,0,IF($X$4=2,2)))","v":98},{"$f":"($AA$24*(I24/$I$14)^$AA$26)*$J$14","v":0.27637570088274294},{"$f":"L24-8","v":22.019276797677907},30.019276797677907,6.7,{"$f":"AD24*Cubics","v":179},{"$f":"((($D24/Watts)/(((p_atm*0.028964)/(8.31447*(20+273.15)))*(($N24/3600)/Cubics)*(1005+1870*((0.622)/(((p_atm)/($E$12*Pvs_Heat_in))-1)))))+Tl_heat)*Celc1+Celc2","v":60.049524463654784},{"$f":"(Tl_cool-(($G24/Watts)/(1006*$N24*kgss)))*Celc1+Celc2","v":20.301361803339859},1,0.87749999999999995,0.68,1.04,0.85870000000000002,0.87749999999999995,{"$f":"(H24-G24)/H24","v":0},2442.275240165839,2.8777145031522588E-5,398.30479940047127,2.8777145031522588E-5,30.019276797677907,6.7,179,1021,4.0202009009986008E-4,135,{"$f":"AF24","v":4.0202009009986008E-4},27,1.3,75,{"$f":"AE24","v":1021},{"$f":"AH24","v":4.0202009009986008E-4},135,{"$f":"AM24","v":4.0202009009986008E-4},27,1.3,75,null,{"$f":"(AG24*((((Tv_cool-Tr_cool)/LN((Tv_cool-Tl_cool)/(Tr_cool-Tl_cool)))/((16-18)/LN((16-27)/(18-27))))^S24))*$G$14","v":4.022939780285293E-2},{"$f":"((AT24/$G$14)/(IF((237.3*LN((RH*EXP(17.27*(Tl_cool/(Tl_cool+237.3))))))/(17.27-LN((RH*EXP(17.27*(Tl_cool/(Tl_cool+237.3))))))<((Tv_cool+Tr_cool)/2),1,1/(1+((2258*((0.622/((p_atm/(1*611*EXP(17.27*(((Tv_cool+Tr_cool)/2)/(((Tv_cool+Tr_cool)/2)+237.3))))))-1)*1000-(0.622/((p_atm/(RH*611*EXP(17.27*(Tl_cool/(Tl_cool+237.3))))))-1)*1000))/(1005*(((Tv_cool+Tr_cool)/2)-Tl_cool))))+-((-0.000625*$C24+0.00625)*(Tl_cool-(Tv_cool+Tr_cool)/2)-(-0.000625*$C24+0.00625)*10))))*$H$14","v":120.28723595537437},null,1015,4.5000000000000003E-5,144,6.0841300000000003E-6,31.9,1.8,78,1014.3629699999999,4.0195199999999998E-5,222.45572868953656,1.3302510869177982E-5,33,1.8,85,1311.2625113075501,2.9439637778696419E-5,231.65460637567074,{"$f":"BL24","v":2.9439637778696419E-5},33,1.8,85,null,1628.1834934438923,2.3978861066814286E-5,362.09527218224656,7.1743257974481045E-5,30.019276797677907,6.7,179,2442.275240165839,2.8777145031522588E-5,398.30479940047127,2.8777145031522588E-5,30.019276797677907,6.7,179]
[null,0.6,6,{"$f":"(X25*($T$11^$Q25))*Watts*CF_Altit","v":3189.3765549747113},{"$f":"ROUND(((D25/Watts)/(($S$9-$S$10)*1.163))*$E$14,IF($X$4=1,0,IF($X$4=2,2)))","v":274},{"$f":"($Y$24*(E25/$E$14)^$Y$26)*$F$14","v":2.1604729403865899},{"$f":"(Z25*($W$11^R25))*Watts*CF_Altit","v":507.41658932120805},{"$f":"((G25/Watts)/(IF((237.3*LN((RH*EXP(17.27*(Tl_cool/(Tl_cool+237.3))))))/(17.27-LN((RH*EXP(17.27*(Tl_cool/(Tl_cool+237.3))))))<Tavg_cold,1,IF(1/(1+((2258*((0.622/(($Z$11/(1*611*EXP(17.27*(Tavg_cold/(Tavg_cold+237.3))))))-1)*1000-(0.622/(($Z$11/(RH*611*EXP(17.27*(Tl_cool/(Tl_cool+237.3))))))-1)*1000))/(1005*(Tavg_cold-Tl_cool))))*1.039+((-0.000729*$C25+0.001448)*(Tl_cool-Tavg_cold)+(0.016908*$C25-0.033574))*1.039>1,1,1/(1+((2258*((0.622/(($Z$11/(1*611*EXP(17.27*(Tavg_cold/(Tavg_cold+237.3))))))-1)*1000-(0.622/(($Z$11/(RH*611*EXP(17.27*(Tl_cool/(Tl_cool+237.3))))))-1)*1000))/(1005*(Tavg_cold-Tl_cool))))*1.039+((-0.000729*$C25+0.001448)*(Tl_cool-Tavg_cold)+(0.016908*$C25-0.033574))*1.039))))*Watts","v":507.41658932120805},{"$f":"ROUND(((H25/Watts)/((Tr_cool-Tv_cool)*1.163))*$I$14,IF($X$4=1,0,IF($X$4=2,2)))","v":145},{"$f":"($AA$24*(I25/$I$14)^$AA$26)*$J$14","v":0.60503947428776239},{"$f":"L25-8","v":27.99082010896673},35.99082010896673,12.1,{"$f":"AD25*Cubics","v":260},{"$f":"((($D25/Watts)/(((p_atm*0.028964)/(8.31447*(20+273.15)))*(($N25/3600)/Cubics)*(1005+1870*((0.622)/(((p_atm)/($E$12*Pvs_Heat_in))-1)))))+Tl_heat)*Celc1+Celc2","v":56.007107689551226},{"$f":"(Tl_cool-(($G25/Watts)/(1006*$N25*kgss)))*Celc1+Celc2","v":20.199447699325543},1,0.88200000000000001,0.79,0.95,0.8831,0.88200000000000001,{"$f":"(H25-G25)/H25","v":0},{"$f":"IF($X$16=1,AE25,IF($X$16=2,AL25,IF($X$16=3,BK25,IF($X$16=4,BD25,IF($X$16=5,BZ25,IF($X$16=6,BS25,IF($X$16=7,AW25,)))))))","v":3189.3765549747113},"b",589.33978043078685,"b",35.99082010896673,12.1,260,1438,"b",214,"b",37,2.7,98,{"$f":"AE25","v":1438},"b",214,"b",37,2.7,98,null,{"$f":"(AG25*((((Tv_cool-Tr_cool)/LN((Tv_cool-Tl_cool)/(Tr_cool-Tl_cool)))/((16-18)/LN((16-27)/(18-27))))^S25))*$G$14","v":6.2591711057126492E-2},{"$f":"((AT25/$G$14)/(IF((237.3*LN((RH*EXP(17.27*(Tl_cool/(Tl_cool+237.3))))))/(17.27-LN((RH*EXP(17.27*(Tl_cool/(Tl_cool+237.3))))))<((Tv_cool+Tr_cool)/2),1,1/(1+((2258*((0.622/((p_atm/(1*611*EXP(17.27*(((Tv_cool+Tr_cool)/2)/(((Tv_cool+Tr_cool)/2)+237.3))))))-1)*1000-(0.622/((p_atm/(RH*611*EXP(17.27*(Tl_cool/(Tl_cool+237.3))))))-1)*1000))/(1005*(((Tv_cool+Tr_cool)/2)-Tl_cool))))+-((-0.000625*$C25+0.00625)*(Tl_cool-(Tv_cool+Tr_cool)/2)-(-0.000625*$C25+0.00625)*10))))*$H$14","v":187.15129551964756},null,1351,"b",218,"b",37,3.6,123,1430.7324699999999,"b",319.80448376845339,"b",37,3.2,133,1954.7307439707715,"b",330.83703764540519,"b",37,3.2,133,null,2126.2510366498072,"b",535.76343675526061,"b",35.99082010896673,12.1,260,3189.3765549747113,"b",589.33978043078685,"b",35.99082010896673,12.1,260]
[null,0.8,8,{"$f":"(X26*($T$11^$Q26))*Watts*CF_Altit","v":3854.3051570520838},{"$f":"ROUND(((D26/Watts)/(($S$9-$S$10)*1.163))*$E$14,IF($X$4=1,0,IF($X$4=2,2)))","v":331},{"$f":"($Y$24*(E26/$E$14)^$Y$26)*$F$14","v":3.1528527867986464},{"$f":"(Z26*($W$11^R26))*Watts*CF_Altit","v":668.54415517904727},{"$f":"((G26/Watts)/(IF((237.3*LN((RH*EXP(17.27*(Tl_cool/(Tl_cool+237.3))))))/(17.27-LN((RH*EXP(17.27*(Tl_cool/(Tl_cool+237.3))))))<Tavg_cold,1,IF(1/(1+((2258*((0.622/(($Z$11/(1*611*EXP(17.27*(Tavg_cold/(Tavg_cold+237.3))))))-1)*1000-(0.622/(($Z$11/(RH*611*EXP(17.27*(Tl_cool/(Tl_cool+237.3))))))-1)*1000))/(1005*(Tavg_cold-Tl_cool))))*1.039+((-0.000729*$C26+0.001448)*(Tl_cool-Tavg_cold)+(0.016908*$C26-0.033574))*1.039>1,1,1/(1+((2258*((0.622/(($Z$11/(1*611*EXP(17.27*(Tavg_cold/(Tavg_cold+237.3))))))-1)*1000-(0.622/(($Z$11/(RH*611*EXP(17.27*(Tl_cool/(Tl_cool+237.3))))))-1)*1000))/(1005*(Tavg_cold-Tl_cool))))*1.039+((-0.000729*$C26+0.001448)*(Tl_cool-Tavg_cold)+(0.016908*$C26-0.033574))*1.039))))*Watts","v":668.54415517904727},{"$f":"ROUND(((H26/Watts)/((Tr_cool-Tv_cool)*1.163))*$I$14,IF($X$4=1,0,IF($X$4=2,2)))","v":192},{"$f":"($AA$24*(I26/$I$14)^$AA$26)*$J$14","v":1.0608406744420487},{"$f":"L26-8","v":36.01549794824809},44.01549794824809,18.399999999999999,{"$f":"AD26*Cubics","v":351},{"$f":"((($D26/Watts)/(((p_atm*0.028964)/(8.31447*(20+273.15)))*(($N26/3600)/Cubics)*(1005+1870*((0.622)/(((p_atm)/($E$12*Pvs_Heat_in))-1)))))+Tl_heat)*Celc1+Celc2","v":52.232557625860359},{"$f":"(Tl_cool-(($G26/Watts)/(1006*$N26*kgss)))*Celc1+Celc2","v":20.338897569696837},1,0.89500000000000002,0.87,0.95,0.85389999999999999,0.89500000000000002,{"$f":"(H26-G26)/H26","v":0},3854.3051570520838,2,778.1964718181265,2,44.01549794824809,18.399999999999999,351,1834,1.8235155847906248,296,{"$f":"AF26","v":1.8235155847906248},40,4.5999999999999996,125,{"$f":"AE26","v":1834},{"$f":"AH26","v":1.8235155847906248},296,{"$f":"AM26","v":1.8235155847906248},40,4.5999999999999996,125,null,{"$f":"(AG26*((((Tv_cool-Tr_cool)/LN((Tv_cool-Tl_cool)/(Tr_cool-Tl_cool)))/((16-18)/LN((16-27)/(18-27))))^S26))*$G$14","v":8.5408082320815704E-2},{"$f":"((AT26/$G$14)/(IF((237.3*LN((RH*EXP(17.27*(Tl_cool/(Tl_cool+237.3))))))/(17.27-LN((RH*EXP(17.27*(Tl_cool/(Tl_cool+237.3))))))<((Tv_cool+Tr_cool)/2),1,1/(1+((2258*((0.622/((p_atm/(1*611*EXP(17.27*(((Tv_cool+Tr_cool)/2)/(((Tv_cool+Tr_cool)/2)+237.3))))))-1)*1000-(0.622/((p_atm/(RH*611*EXP(17.27*(Tl_cool/(Tl_cool+237.3))))))-1)*1000))/(1005*(((Tv_cool+Tr_cool)/2)-Tl_cool))))+-((-0.000625*$C26+0.00625)*(Tl_cool-(Tv_cool+Tr_cool)/2)-(-0.000625*$C26+0.00625)*10))))*$H$14","v":255.37300361705724},null,1654,1.8,293,2,44,6.5,168,1757.7295299999996,1.8944300000000001,414.54157104296314,1.9435633812010937,44,6.4,168,2523.2878282336105,1.8903189865021812,425.1280286376699,{"$f":"BL26","v":1.8903189865021812},44,6.4,168,null,2569.5367713680557,2,707.45133801647853,2,44.01549794824809,18.399999999999999,351,3854.3051570520838,2,778.1964718181265,2,44.01549794824809,18.399999999999999,351]
[null,1,10,{"$f":"(X27*($T$11^$Q27))*Watts*CF_Altit","v":4464.1278865985905},{"$f":"ROUND(((D27/Watts)/(($S$9-$S$10)*1.163))*$E$14,IF($X$4=1,0,IF($X$4=2,2)))","v":384},{"$f":"($Y$24*(E27/$E$14)^$Y$26)*$F$14","v":4.2433626977681946},{"$f":"(Z27*($W$11^R27))*Watts*CF_Altit","v":827.14945940573136},{"$f":"((G27/Watts)/(IF((237.3*LN((RH*EXP(17.27*(Tl_cool/(Tl_cool+237.3))))))/(17.27-LN((RH*EXP(17.27*(Tl_cool/(Tl_cool+237.3))))))<Tavg_cold,1,IF(1/(1+((2258*((0.622/(($Z$11/(1*611*EXP(17.27*(Tavg_cold/(Tavg_cold+237.3))))))-1)*1000-(0.622/(($Z$11/(RH*611*EXP(17.27*(Tl_cool/(Tl_cool+237.3))))))-1)*1000))/(1005*(Tavg_cold-Tl_cool))))*1.039+((-0.000729*$C27+0.001448)*(Tl_cool-Tavg_cold)+(0.016908*$C27-0.033574))*1.039>1,1,1/(1+((2258*((0.622/(($Z$11/(1*611*EXP(17.27*(Tavg_cold/(Tavg_cold+237.3))))))-1)*1000-(0.622/(($Z$11/(RH*611*EXP(17.27*(Tl_cool/(Tl_cool+237.3))))))-1)*1000))/(1005*(Tavg_cold-Tl_cool))))*1.039+((-0.000729*$C27+0.001448)*(Tl_cool-Tavg_cold)+(0.016908*$C27-0.033574))*1.039))))*Watts","v":827.14945940573136},{"$f":"ROUND(((H27/Watts)/((Tr_cool-Tv_cool)*1.163))*$I$14,IF($X$4=1,0,IF($X$4=2,2)))","v":237},{"$f":"($AA$24*(I27/$I$14)^$AA$26)*$J$14","v":1.6163834592755921},{"$f":"L27-8","v":41.003336021104822},49.003336021104822,24,{"$f":"AD27*Cubics","v":401},{"$f":"((($D27/Watts)/(((p_atm*0.028964)/(8.31447*(20+273.15)))*(($N27/3600)/Cubics)*(1005+1870*((0.622)/(((p_atm)/($E$12*Pvs_Heat_in))-1)))))+Tl_heat)*Celc1+Celc2","v":52.677441296110963},{"$f":"(Tl_cool-(($G27/Watts)/(1006*$N27*kgss)))*Celc1+Celc2","v":19.869192913165335},1,0.91110000000000002,0.91,0.98,0.77110000000000001,0.91110000000000002,{"$f":"(H27-G27)/H27","v":0},4464.1278865985905,0,965.44976095318657,0,49.003336021104822,24,401,2214,null,381,null,45,7.1,160,{"$f":"AE27","v":2214},null,381,null,45,7.1,160,null,{"$f":"(AG27*((((Tv_cool-Tr_cool)/LN((Tv_cool-Tl_cool)/(Tr_cool-Tl_cool)))/((16-18)/LN((16-27)/(18-27))))^S27))*$G$14","v":0.10919037055688813},{"$f":"((AT27/$G$14)/(IF((237.3*LN((RH*EXP(17.27*(Tl_cool/(Tl_cool+237.3))))))/(17.27-LN((RH*EXP(17.27*(Tl_cool/(Tl_cool+237.3))))))<((Tv_cool+Tr_cool)/2),1,1/(1+((2258*((0.622/((p_atm/(1*611*EXP(17.27*(((Tv_cool+Tr_cool)/2)/(((Tv_cool+Tr_cool)/2)+237.3))))))-1)*1000-(0.622/((p_atm/(RH*611*EXP(17.27*(Tl_cool/(Tl_cool+237.3))))))-1)*1000))/(1005*(((Tv_cool+Tr_cool)/2)-Tl_cool))))+-((-0.000625*$C27+0.00625)*(Tl_cool-(Tv_cool+Tr_cool)/2)-(-0.000625*$C27+0.00625)*10))))*$H$14","v":326.48283555215761},null,1936,null,368,null,47.1,9.8000000000000007,202,1995.3541499999994,null,506.6669905130658,null,47,10.3,202,3016.9337640960675,null,514.52757935246484,null,47,10.3,202,null,2976.0852577323931,null,877.68160086653302,null,49.003336021104822,24,401,4464.1278865985905,null,965.44976095318657,null,49.003336021104822,24,401]
[null,{"$f":"IF($S$7=1,NL!A27,IF(cal!$S$7=2,EN!A27,IF(cal!$S$7=3,DE!A27,IF(cal!$S$7=4,FR!A27,IF(cal!$S$7=5,NR!A27,IF(cal!$S$7=6,SP!A27,IF(cal!$S$7=7,SW!A27,IF(cal!$S$7=8,TS!A27,IF(cal!$S$7=9,ExtraTaal1!A27,IF(cal!$S$7=10,ExtraTaal2!A27,IF(cal!$S$7=11,ExtraTaal3!A27,)))))))))))","v":"Clima Canal altura 19 cm ancho 34 cm longitud 200 cm (Type 3)"},{"$f":"IF($S$7=1,NL!B27,IF(cal!$S$7=2,EN!B27,IF(cal!$S$7=3,DE!B27,IF(cal!$S$7=4,FR!B27,IF(cal!$S$7=5,NR!B27,IF(cal!$S$7=6,SP!B27,IF(cal!$S$7=7,SW!B27,IF(cal!$S$7=8,TS!B27,IF(cal!$S$7=9,ExtraTaal1!B27,IF(cal!$S$7=10,ExtraTaal2!B27,IF(cal!$S$7=11,ExtraTaal3!B27,)))))))))))","v":0},{"$f":"IF($S$7=1,NL!C27,IF(cal!$S$7=2,EN!C27,IF(cal!$S$7=3,DE!C27,IF(cal!$S$7=4,FR!C27,IF(cal!$S$7=5,NR!C27,IF(cal!$S$7=6,SP!C27,IF(cal!$S$7=7,SW!C27,IF(cal!$S$7=8,TS!C27,IF(cal!$S$7=9,ExtraTaal1!C27,IF(cal!$S$7=10,ExtraTaal2!C27,IF(cal!$S$7=11,ExtraTaal3!C27,)))))))))))","v":0},{"$f":"IF($S$7=1,NL!D27,IF(cal!$S$7=2,EN!D27,IF(cal!$S$7=3,DE!D27,IF(cal!$S$7=4,FR!D27,IF(cal!$S$7=5,NR!D27,IF(cal!$S$7=6,SP!D27,IF(cal!$S$7=7,SW!D27,IF(cal!$S$7=8,TS!D27,IF(cal!$S$7=9,ExtraTaal1!D27,IF(cal!$S$7=10,ExtraTaal2!D27,IF(cal!$S$7=11,ExtraTaal3!D27,)))))))))))","v":0},{"$f":"IF($S$7=1,NL!E27,IF(cal!$S$7=2,EN!E27,IF(cal!$S$7=3,DE!E27,IF(cal!$S$7=4,FR!E27,IF(cal!$S$7=5,NR!E27,IF(cal!$S$7=6,SP!E27,IF(cal!$S$7=7,SW!E27,IF(cal!$S$7=8,TS!E27,IF(cal!$S$7=9,ExtraTaal1!E27,IF(cal!$S$7=10,ExtraTaal2!E27,IF(cal!$S$7=11,ExtraTaal3!E27,)))))))))))","v":0},{"$f":"IF($S$7=1,NL!F27,IF(cal!$S$7=2,EN!F27,IF(cal!$S$7=3,DE!F27,IF(cal!$S$7=4,FR!F27,IF(cal!$S$7=5,NR!F27,IF(cal!$S$7=6,SP!F27,IF(cal!$S$7=7,SW!F27,IF(cal!$S$7=8,TS!F27,IF(cal!$S$7=9,ExtraTaal1!F27,IF(cal!$S$7=10,ExtraTaal2!F27,IF(cal!$S$7=11,ExtraTaal3!F27,)))))))))))","v":0},{"$f":"IF($S$7=1,NL!G27,IF(cal!$S$7=2,EN!G27,IF(cal!$S$7=3,DE!G27,IF(cal!$S$7=4,FR!G27,IF(cal!$S$7=5,NR!G27,IF(cal!$S$7=6,SP!G27,IF(cal!$S$7=7,SW!G27,IF(cal!$S$7=8,TS!G27,IF(cal!$S$7=9,ExtraTaal1!G27,IF(cal!$S$7=10,ExtraTaal2!G27,IF(cal!$S$7=11,ExtraTaal3!G27,)))))))))))","v":0},{"$f":"IF($S$7=1,NL!H27,IF(cal!$S$7=2,EN!H27,IF(cal!$S$7=3,DE!H27,IF(cal!$S$7=4,FR!H27,IF(cal!$S$7=5,NR!H27,IF(cal!$S$7=6,SP!H27,IF(cal!$S$7=7,SW!H27,IF(cal!$S$7=8,TS!H27,IF(cal!$S$7=9,ExtraTaal1!H27,IF(cal!$S$7=10,ExtraTaal2!H27,IF(cal!$S$7=11,ExtraTaal3!H27,)))))))))))","v":0},{"$f":"IF($S$7=1,NL!I27,IF(cal!$S$7=2,EN!I27,IF(cal!$S$7=3,DE!I27,IF(cal!$S$7=4,FR!I27,IF(cal!$S$7=5,NR!I27,IF(cal!$S$7=6,SP!I27,IF(cal!$S$7=7,SW!I27,IF(cal!$S$7=8,TS!I27,IF(cal!$S$7=9,ExtraTaal1!I27,IF(cal!$S$7=10,ExtraTaal2!I27,IF(cal!$S$7=11,ExtraTaal3!I27,)))))))))))","v":0},{"$f":"IF($S$7=1,NL!J27,IF(cal!$S$7=2,EN!J27,IF(cal!$S$7=3,DE!J27,IF(cal!$S$7=4,FR!J27,IF(cal!$S$7=5,NR!J27,IF(cal!$S$7=6,SP!J27,IF(cal!$S$7=7,SW!J27,IF(cal!$S$7=8,TS!J27,IF(cal!$S$7=9,ExtraTaal1!J27,IF(cal!$S$7=10,ExtraTaal2!J27,IF(cal!$S$7=11,ExtraTaal3!J27,)))))))))))","v":0},{"$f":"IF($S$7=1,NL!K27,IF(cal!$S$7=2,EN!K27,IF(cal!$S$7=3,DE!K27,IF(cal!$S$7=4,FR!K27,IF(cal!$S$7=5,NR!K27,IF(cal!$S$7=6,SP!K27,IF(cal!$S$7=7,SW!K27,IF(cal!$S$7=8,TS!K27,IF(cal!$S$7=9,ExtraTaal1!K27,IF(cal!$S$7=10,ExtraTaal2!K27,IF(cal!$S$7=11,ExtraTaal3!K27,)))))))))))","v":0},{"$f":"IF($S$7=1,NL!L27,IF(cal!$S$7=2,EN!L27,IF(cal!$S$7=3,DE!L27,IF(cal!$S$7=4,FR!L27,IF(cal!$S$7=5,NR!L27,IF(cal!$S$7=6,SP!L27,IF(cal!$S$7=7,SW!L27,IF(cal!$S$7=8,TS!L27,IF(cal!$S$7=9,ExtraTaal1!L27,IF(cal!$S$7=10,ExtraTaal2!L27,IF(cal!$S$7=11,ExtraTaal3!L27,)))))))))))","v":0},{"$f":"IF($S$7=1,NL!M27,IF(cal!$S$7=2,EN!M27,IF(cal!$S$7=3,DE!M27,IF(cal!$S$7=4,FR!M27,IF(cal!$S$7=5,NR!M27,IF(cal!$S$7=6,SP!M27,IF(cal!$S$7=7,SW!M27,IF(cal!$S$7=8,TS!M27,IF(cal!$S$7=9,ExtraTaal1!M27,IF(cal!$S$7=10,ExtraTaal2!M27,IF(cal!$S$7=11,ExtraTaal3!M27,)))))))))))","v":0},{"$f":"IF($S$7=1,NL!N27,IF(cal!$S$7=2,EN!N27,IF(cal!$S$7=3,DE!N27,IF(cal!$S$7=4,FR!N27,IF(cal!$S$7=5,NR!N27,IF(cal!$S$7=6,SP!N27,IF(cal!$S$7=7,SW!N27,IF(cal!$S$7=8,TS!N27,IF(cal!$S$7=9,ExtraTaal1!N27,IF(cal!$S$7=10,ExtraTaal2!N27,IF(cal!$S$7=11,ExtraTaal3!N27,)))))))))))","v":0},{"$f":"IF($S$7=1,NL!O27,IF(cal!$S$7=2,EN!O27,IF(cal!$S$7=3,DE!O27,IF(cal!$S$7=4,FR!O27,IF(cal!$S$7=5,NR!O27,IF(cal!$S$7=6,SP!O27,IF(cal!$S$7=7,SW!O27,IF(cal!$S$7=8,TS!O27,IF(cal!$S$7=9,ExtraTaal1!O27,IF(cal!$S$7=10,ExtraTaal2!O27,IF(cal!$S$7=11,ExtraTaal3!O27,)))))))))))","v":0},"n-value","n-value","n-value","n-value","n-value","n-value",null,"H",19,"B",34,"L",120,0,"H",{"$f":"AF22","v":8},"B",{"$f":"AH22","v":18},"L",{"$f":"108*IF($X$4=1,1,IF($X$4=2,1/2.54))","v":108},null,"H",{"$f":"AM22","v":10},"B",{"$f":"AO22","v":18},"L",{"$f":"AJ28","v":108},null,null,null,null,null,"H",{"$f":"AX22","v":13},"B",{"$f":"AZ22","v":27},"L",{"$f":"IF($X$4=1,108.3,108.3/2.54)","v":108.3},null,"H",{"$f":"BE22","v":13},"B",{"$f":"BG22","v":32},"L",{"$f":"IF($X$4=1,100,100/2.54)","v":100},null,"H",{"$f":"BL22","v":13},"B",{"$f":"BN22","v":32},"L",{"$f":"IF($X$4=1,100,100/2.54)","v":100},null,null,"H",{"$f":"BT22","v":19},"B",{"$f":"BV22","v":34},"L",{"$f":"120*IF($X$4=1,1,IF($X$4=2,1/2.54))","v":120},null,"H",{"$f":"CA22","v":19},"B",{"$f":"CC22","v":34},"L",{"$f":"BX28","v":120}]
[null,0.2,2,{"$f":"(X29*($T$11^$Q29))*Watts*CF_Altit","v":3021.3962029589957},{"$f":"ROUND(((D29/Watts)/(($S$9-$S$10)*1.163))*$E$14,IF($X$4=1,0,IF($X$4=2,2)))","v":260},{"$f":"($Y$30*(E29/$E$14)^$Y$32)*$F$14","v":2.2728907691237459},{"$f":"(Z29*($W$11^R29))*Watts*CF_Altit","v":343.00721415516836},{"$f":"((G29/Watts)/(IF((237.3*LN((RH*EXP(17.27*(Tl_cool/(Tl_cool+237.3))))))/(17.27-LN((RH*EXP(17.27*(Tl_cool/(Tl_cool+237.3))))))<Tavg_cold,1,IF(1/(1+((2258*((0.622/(($Z$11/(1*611*EXP(17.27*(Tavg_cold/(Tavg_cold+237.3))))))-1)*1000-(0.622/(($Z$11/(RH*611*EXP(17.27*(Tl_cool/(Tl_cool+237.3))))))-1)*1000))/(1005*(Tavg_cold-Tl_cool))))*1.039+((-0.000729*$C29+0.001448)*(Tl_cool-Tavg_cold)+(0.016908*$C29-0.033574))*1.039>1,1,1/(1+((2258*((0.622/(($Z$11/(1*611*EXP(17.27*(Tavg_cold/(Tavg_cold+237.3))))))-1)*1000-(0.622/(($Z$11/(RH*611*EXP(17.27*(Tl_cool/(Tl_cool+237.3))))))-1)*1000))/(1005*(Tavg_cold-Tl_cool))))*1.039+((-0.000729*$C29+0.001448)*(Tl_cool-Tavg_cold)+(0.016908*$C29-0.033574))*1.039))))*Watts","v":343.00721415516836},{"$f":"ROUND(((H29/Watts)/((Tr_cool-Tv_cool)*1.163))*$I$14,IF($X$4=1,0,IF($X$4=2,2)))","v":98},{"$f":"($AA$30*(I29/$I$14)^$AA$32)*$J$14","v":0.32291187790923753},{"$f":"L29-8","v":21.1043935579596},{"$f":"AB29","v":29.1043935579596},4.5999999999999996,{"$f":"AD29*Cubics","v":179},{"$f":"((($D29/Watts)/(((p_atm*0.028964)/(8.31447*(20+273.15)))*(($N29/3600)/Cubics)*(1005+1870*((0.622)/(((p_atm)/($E$12*Pvs_Heat_in))-1)))))+Tl_heat)*Celc1+Celc2","v":69.546209679701491},{"$f":"(Tl_cool-(($G29/Watts)/(1006*$N29*kgss)))*Celc1+Celc2","v":20.304547208856},1,0.87660000000000005,0.6,1.1599999999999999,0.78069999999999995,0.87660000000000005,{"$f":"(H29-G29)/H29","v":0},{"$f":"IF($X$16=1,AE29,IF($X$16=2,AL29,IF($X$16=3,BK29,IF($X$16=4,BD29,IF($X$16=5,BZ29,IF($X$16=6,BS29,IF($X$16=7,AW29,)))))))","v":3021.3962029589957},"a",398.02136385372961,"a",29.1043935579596,4.5999999999999996,179,894,"a",97,"a",24,1.1000000000000001,66,{"$f":"AE29","v":894},"a",97,"a",{"$f":"AI29","v":24},1.1000000000000001,66,null,{"$f":"(AG29*((((Tv_cool-Tr_cool)/LN((Tv_cool-Tl_cool)/(Tr_cool-Tl_cool)))/((16-18)/LN((16-27)/(18-27))))^S29))*$G$14","v":2.9300652265448691E-2},{"$f":"((AT29/$G$14)/(IF((237.3*LN((RH*EXP(17.27*(Tl_cool/(Tl_cool+237.3))))))/(17.27-LN((RH*EXP(17.27*(Tl_cool/(Tl_cool+237.3))))))<((Tv_cool+Tr_cool)/2),1,1/(1+((2258*((0.622/((p_atm/(1*611*EXP(17.27*(((Tv_cool+Tr_cool)/2)/(((Tv_cool+Tr_cool)/2)+237.3))))))-1)*1000-(0.622/((p_atm/(RH*611*EXP(17.27*(Tl_cool/(Tl_cool+237.3))))))-1)*1000))/(1005*(((Tv_cool+Tr_cool)/2)-Tl_cool))))+-((-0.000625*$C29+0.00625)*(Tl_cool-(Tv_cool+Tr_cool)/2)-(-0.000625*$C29+0.00625)*10))))*$H$14","v":87.609923717288552},null,1091,"a",125,"a",28.8,2,90,668.81662999999992,"a",161.0765044853346,"a",28,1.4,49,779.61797441526835,"a",167.76364343585763,"a",{"$f":"BH29","v":28},1.4,49,null,2014.2641353059967,"a",361.83760350339048,"a",29.1043935579596,4.5999999999999996,179,3021.3962029589957,"a",398.02136385372961,"a",29.1043935579596,4.5999999999999996,179]
[null,0.4,4,{"$f":"(X30*($T$11^$Q30))*Watts*CF_Altit","v":4768.2516593713999},{"$f":"ROUND(((D30/Watts)/(($S$9-$S$10)*1.163))*$E$14,IF($X$4=1,0,IF($X$4=2,2)))","v":410},{"$f":"($Y$30*(E30/$E$14)^$Y$32)*$F$14","v":5.6519665427470667},{"$f":"(Z30*($W$11^R30))*Watts*CF_Altit","v":670.05529669057023},{"$f":"((G30/Watts)/(IF((237.3*LN((RH*EXP(17.27*(Tl_cool/(Tl_cool+237.3))))))/(17.27-LN((RH*EXP(17.27*(Tl_cool/(Tl_cool+237.3))))))<Tavg_cold,1,IF(1/(1+((2258*((0.622/(($Z$11/(1*611*EXP(17.27*(Tavg_cold/(Tavg_cold+237.3))))))-1)*1000-(0.622/(($Z$11/(RH*611*EXP(17.27*(Tl_cool/(Tl_cool+237.3))))))-1)*1000))/(1005*(Tavg_cold-Tl_cool))))*1.039+((-0.000729*$C30+0.001448)*(Tl_cool-Tavg_cold)+(0.016908*$C30-0.033574))*1.039>1,1,1/(1+((2258*((0.622/(($Z$11/(1*611*EXP(17.27*(Tavg_cold/(Tavg_cold+237.3))))))-1)*1000-(0.622/(($Z$11/(RH*611*EXP(17.27*(Tl_cool/(Tl_cool+237.3))))))-1)*1000))/(1005*(Tavg_cold-Tl_cool))))*1.039+((-0.000729*$C30+0.001448)*(Tl_cool-Tavg_cold)+(0.016908*$C30-0.033574))*1.039))))*Watts","v":670.05529669057023},{"$f":"ROUND(((H30/Watts)/((Tr_cool-Tv_cool)*1.163))*$I$14,IF($X$4=1,0,IF($X$4=2,2)))","v":192},{"$f":"($AA$30*(I30/$I$14)^$AA$32)*$J$14","v":1.2394651673517423},{"$f":"L30-8","v":24.553468286911865},32.553468286911865,9.4,{"$f":"AD30*Cubics","v":346},{"$f":"((($D30/Watts)/(((p_atm*0.028964)/(8.31447*(20+273.15)))*(($N30/3600)/Cubics)*(1005+1870*((0.622)/(((p_atm)/($E$12*Pvs_Heat_in))-1)))))+Tl_heat)*Celc1+Celc2","v":60.451893757055117},{"$f":"(Tl_cool-(($G30/Watts)/(1006*$N30*kgss)))*Celc1+Celc2","v":20.244108763378918},1,0.87749999999999995,0.68,1.04,0.85870000000000002,0.87749999999999995,{"$f":"(H30-G30)/H30","v":0},4768.2516593713999,3.3622644513664882E-5,777.6427035913963,3.3622644513664882E-5,32.553468286911865,9.4,346,1605,5.6054747775989447E-4,212,{"$f":"AF30","v":5.6054747775989447E-4},28,2.1,112,{"$f":"AE30","v":1605},{"$f":"AH30","v":5.6054747775989447E-4},212,{"$f":"AM30","v":5.6054747775989447E-4},28,2.1,112,null,{"$f":"(AG30*((((Tv_cool-Tr_cool)/LN((Tv_cool-Tl_cool)/(Tr_cool-Tl_cool)))/((16-18)/LN((16-27)/(18-27))))^S30))*$G$14","v":6.3175054327443123E-2},{"$f":"((AT30/$G$14)/(IF((237.3*LN((RH*EXP(17.27*(Tl_cool/(Tl_cool+237.3))))))/(17.27-LN((RH*EXP(17.27*(Tl_cool/(Tl_cool+237.3))))))<((Tv_cool+Tr_cool)/2),1,1/(1+((2258*((0.622/((p_atm/(1*611*EXP(17.27*(((Tv_cool+Tr_cool)/2)/(((Tv_cool+Tr_cool)/2)+237.3))))))-1)*1000-(0.622/((p_atm/(RH*611*EXP(17.27*(Tl_cool/(Tl_cool+237.3))))))-1)*1000))/(1005*(((Tv_cool+Tr_cool)/2)-Tl_cool))))+-((-0.000625*$C30+0.00625)*(Tl_cool-(Tv_cool+Tr_cool)/2)-(-0.000625*$C30+0.00625)*10))))*$H$14","v":188.89551127806939},null,1779,6.8499999999999998E-5,253,6.4513000000000004E-6,33.1,3.5,133,1333.8473699999997,4.8290800000000002E-5,292.52052512718586,1.411968325044228E-5,34,2.4,114,1724.2585778611092,3.6052122831577476E-5,304.61668712391349,{"$f":"BL30","v":3.6052122831577476E-5},34,2.4,114,null,3178.8344395809327,3.3026323224877546E-5,706.94791235581465,9.8542791184631786E-5,32.553468286911865,9.4,346,4768.2516593713999,3.3622644513664882E-5,777.6427035913963,3.3622644513664882E-5,32.553468286911865,9.4,346]
[null,0.6,6,{"$f":"(X31*($T$11^$Q31))*Watts*CF_Altit","v":6226.8780359030079},{"$f":"ROUND(((D31/Watts)/(($S$9-$S$10)*1.163))*$E$14,IF($X$4=1,0,IF($X$4=2,2)))","v":535},{"$f":"($Y$30*(E31/$E$14)^$Y$32)*$F$14","v":9.6236414259237311},{"$f":"(Z31*($W$11^R31))*Watts*CF_Altit","v":990.6704839128347},{"$f":"((G31/Watts)/(IF((237.3*LN((RH*EXP(17.27*(Tl_cool/(Tl_cool+237.3))))))/(17.27-LN((RH*EXP(17.27*(Tl_cool/(Tl_cool+237.3))))))<Tavg_cold,1,IF(1/(1+((2258*((0.622/(($Z$11/(1*611*EXP(17.27*(Tavg_cold/(Tavg_cold+237.3))))))-1)*1000-(0.622/(($Z$11/(RH*611*EXP(17.27*(Tl_cool/(Tl_cool+237.3))))))-1)*1000))/(1005*(Tavg_cold-Tl_cool))))*1.039+((-0.000729*$C31+0.001448)*(Tl_cool-Tavg_cold)+(0.016908*$C31-0.033574))*1.039>1,1,1/(1+((2258*((0.622/(($Z$11/(1*611*EXP(17.27*(Tavg_cold/(Tavg_cold+237.3))))))-1)*1000-(0.622/(($Z$11/(RH*611*EXP(17.27*(Tl_cool/(Tl_cool+237.3))))))-1)*1000))/(1005*(Tavg_cold-Tl_cool))))*1.039+((-0.000729*$C31+0.001448)*(Tl_cool-Tavg_cold)+(0.016908*$C31-0.033574))*1.039))))*Watts","v":990.6704839128347},{"$f":"ROUND(((H31/Watts)/((Tr_cool-Tv_cool)*1.163))*$I$14,IF($X$4=1,0,IF($X$4=2,2)))","v":284},{"$f":"($AA$30*(I31/$I$14)^$AA$32)*$J$14","v":2.7118680158941548},{"$f":"L31-8","v":30.531203067291003},38.531203067291003,16.899999999999999,{"$f":"AD31*Cubics","v":496},{"$f":"((($D31/Watts)/(((p_atm*0.028964)/(8.31447*(20+273.15)))*(($N31/3600)/Cubics)*(1005+1870*((0.622)/(((p_atm)/($E$12*Pvs_Heat_in))-1)))))+Tl_heat)*Celc1+Celc2","v":56.850592163077579},{"$f":"(Tl_cool-(($G31/Watts)/(1006*$N31*kgss)))*Celc1+Celc2","v":20.063566865861201},1,0.88200000000000001,0.79,0.95,0.8831,0.88200000000000001,{"$f":"(H31-G31)/H31","v":0},{"$f":"IF($X$16=1,AE31,IF($X$16=2,AL31,IF($X$16=3,BK31,IF($X$16=4,BD31,IF($X$16=5,BZ31,IF($X$16=6,BS31,IF($X$16=7,AW31,)))))))","v":6226.8780359030079},"b",1150.6157617934409,"b",38.531203067291003,16.899999999999999,496,2260,"b",336,"b",38,4,150,{"$f":"AE31","v":2260},"b",336,"b",38,4,150,null,{"$f":"(AG31*((((Tv_cool-Tr_cool)/LN((Tv_cool-Tl_cool)/(Tr_cool-Tl_cool)))/((16-18)/LN((16-27)/(18-27))))^S31))*$G$14","v":9.8274836052310743E-2},{"$f":"((AT31/$G$14)/(IF((237.3*LN((RH*EXP(17.27*(Tl_cool/(Tl_cool+237.3))))))/(17.27-LN((RH*EXP(17.27*(Tl_cool/(Tl_cool+237.3))))))<((Tv_cool+Tr_cool)/2),1,1/(1+((2258*((0.622/((p_atm/(1*611*EXP(17.27*(((Tv_cool+Tr_cool)/2)/(((Tv_cool+Tr_cool)/2)+237.3))))))-1)*1000-(0.622/((p_atm/(RH*611*EXP(17.27*(Tl_cool/(Tl_cool+237.3))))))-1)*1000))/(1005*(((Tv_cool+Tr_cool)/2)-Tl_cool))))+-((-0.000625*$C31+0.00625)*(Tl_cool-(Tv_cool+Tr_cool)/2)-(-0.000625*$C31+0.00625)*10))))*$H$14","v":293.84502474112884},null,2367,"b",383,"b",39.200000000000003,6.5,208,1881.3568699999998,"b",420.5303054278088,"b",38,4.2,174,2570.3939704182585,"b",435.03767942348554,"b",38,4.2,174,null,4151.252023935338,"b",1046.014328903128,"b",38.531203067291003,16.899999999999999,496,6226.8780359030079,"b",1150.6157617934409,"b",38.531203067291003,16.899999999999999,496]
[null,0.8,8,{"$f":"(X32*($T$11^$Q32))*Watts*CF_Altit","v":7525.0719732921634},{"$f":"ROUND(((D32/Watts)/(($S$9-$S$10)*1.163))*$E$14,IF($X$4=1,0,IF($X$4=2,2)))","v":647},{"$f":"($Y$30*(E32/$E$14)^$Y$32)*$F$14","v":14.074741597220742},{"$f":"(Z32*($W$11^R32))*Watts*CF_Altit","v":1305.2528743971875},{"$f":"((G32/Watts)/(IF((237.3*LN((RH*EXP(17.27*(Tl_cool/(Tl_cool+237.3))))))/(17.27-LN((RH*EXP(17.27*(Tl_cool/(Tl_cool+237.3))))))<Tavg_cold,1,IF(1/(1+((2258*((0.622/(($Z$11/(1*611*EXP(17.27*(Tavg_cold/(Tavg_cold+237.3))))))-1)*1000-(0.622/(($Z$11/(RH*611*EXP(17.27*(Tl_cool/(Tl_cool+237.3))))))-1)*1000))/(1005*(Tavg_cold-Tl_cool))))*1.039+((-0.000729*$C32+0.001448)*(Tl_cool-Tavg_cold)+(0.016908*$C32-0.033574))*1.039>1,1,1/(1+((2258*((0.622/(($Z$11/(1*611*EXP(17.27*(Tavg_cold/(Tavg_cold+237.3))))))-1)*1000-(0.622/(($Z$11/(RH*611*EXP(17.27*(Tl_cool/(Tl_cool+237.3))))))-1)*1000))/(1005*(Tavg_cold-Tl_cool))))*1.039+((-0.000729*$C32+0.001448)*(Tl_cool-Tavg_cold)+(0.016908*$C32-0.033574))*1.039))))*Watts","v":1305.2528743971875},{"$f":"ROUND(((H32/Watts)/((Tr_cool-Tv_cool)*1.163))*$I$14,IF($X$4=1,0,IF($X$4=2,2)))","v":374},{"$f":"($AA$30*(I32/$I$14)^$AA$32)*$J$14","v":4.703001023993389},{"$f":"L32-8","v":38.544850742514384},46.544850742514384,27.7,{"$f":"AD32*Cubics","v":660},{"$f":"((($D32/Watts)/(((p_atm*0.028964)/(8.31447*(20+273.15)))*(($N32/3600)/Cubics)*(1005+1870*((0.622)/(((p_atm)/($E$12*Pvs_Heat_in))-1)))))+Tl_heat)*Celc1+Celc2","v":53.467441327110862},{"$f":"(Tl_cool-(($G32/Watts)/(1006*$N32*kgss)))*Celc1+Celc2","v":20.12201117788652},1,0.89500000000000002,0.87,0.95,0.85389999999999999,0.89500000000000002,{"$f":"(H32-G32)/H32","v":0},7525.0719732921634,2,1519.3359687877708,2,46.544850742514384,27.7,660,2881,1.8235155847906248,465,{"$f":"AF32","v":1.8235155847906248},43,6.6,193,{"$f":"AE32","v":2881},{"$f":"AH32","v":1.8235155847906248},465,{"$f":"AM32","v":1.8235155847906248},43,6.6,193,null,{"$f":"(AG32*((((Tv_cool-Tr_cool)/LN((Tv_cool-Tl_cool)/(Tr_cool-Tl_cool)))/((16-18)/LN((16-27)/(18-27))))^S32))*$G$14","v":0.13417148067290308},{"$f":"((AT32/$G$14)/(IF((237.3*LN((RH*EXP(17.27*(Tl_cool/(Tl_cool+237.3))))))/(17.27-LN((RH*EXP(17.27*(Tl_cool/(Tl_cool+237.3))))))<((Tv_cool+Tr_cool)/2),1,1/(1+((2258*((0.622/((p_atm/(1*611*EXP(17.27*(((Tv_cool+Tr_cool)/2)/(((Tv_cool+Tr_cool)/2)+237.3))))))-1)*1000-(0.622/((p_atm/(RH*611*EXP(17.27*(Tl_cool/(Tl_cool+237.3))))))-1)*1000))/(1005*(((Tv_cool+Tr_cool)/2)-Tl_cool))))+-((-0.000625*$C32+0.00625)*(Tl_cool-(Tv_cool+Tr_cool)/2)-(-0.000625*$C32+0.00625)*10))))*$H$14","v":401.17718473625558},null,2900,1.8,513,2,46.5,11.5,285,2311.3451299999997,1.88069,545.10584538720343,1.9390875559456291,45,7.2,235,3318.0241520867162,1.8750009582627225,559.02662033457375,{"$f":"BL32","v":1.8750009582627225},45,7.2,235,null,5016.7146488614417,2,1381.2145170797912,2,46.544850742514384,27.7,660,7525.0719732921634,2,1519.3359687877708,2,46.544850742514384,27.7,660]
[null,1,10,{"$f":"(X33*($T$11^$Q33))*Watts*CF_Altit","v":8715.6782547877228},{"$f":"ROUND(((D33/Watts)/(($S$9-$S$10)*1.163))*$E$14,IF($X$4=1,0,IF($X$4=2,2)))","v":749},{"$f":"($Y$30*(E33/$E$14)^$Y$32)*$F$14","v":18.862337194810511},{"$f":"(Z33*($W$11^R33))*Watts*CF_Altit","v":1614.9108493159515},{"$f":"((G33/Watts)/(IF((237.3*LN((RH*EXP(17.27*(Tl_cool/(Tl_cool+237.3))))))/(17.27-LN((RH*EXP(17.27*(Tl_cool/(Tl_cool+237.3))))))<Tavg_cold,1,IF(1/(1+((2258*((0.622/(($Z$11/(1*611*EXP(17.27*(Tavg_cold/(Tavg_cold+237.3))))))-1)*1000-(0.622/(($Z$11/(RH*611*EXP(17.27*(Tl_cool/(Tl_cool+237.3))))))-1)*1000))/(1005*(Tavg_cold-Tl_cool))))*1.039+((-0.000729*$C33+0.001448)*(Tl_cool-Tavg_cold)+(0.016908*$C33-0.033574))*1.039>1,1,1/(1+((2258*((0.622/(($Z$11/(1*611*EXP(17.27*(Tavg_cold/(Tavg_cold+237.3))))))-1)*1000-(0.622/(($Z$11/(RH*611*EXP(17.27*(Tl_cool/(Tl_cool+237.3))))))-1)*1000))/(1005*(Tavg_cold-Tl_cool))))*1.039+((-0.000729*$C33+0.001448)*(Tl_cool-Tavg_cold)+(0.016908*$C33-0.033574))*1.039))))*Watts","v":1614.9108493159515},{"$f":"ROUND(((H33/Watts)/((Tr_cool-Tv_cool)*1.163))*$I$14,IF($X$4=1,0,IF($X$4=2,2)))","v":463},{"$f":"($AA$30*(I33/$I$14)^$AA$32)*$J$14","v":7.2076526817498268},{"$f":"L33-8","v":43.540571811172136},51.540571811172136,38.9,{"$f":"AD33*Cubics","v":752},{"$f":"((($D33/Watts)/(((p_atm*0.028964)/(8.31447*(20+273.15)))*(($N33/3600)/Cubics)*(1005+1870*((0.622)/(((p_atm)/($E$12*Pvs_Heat_in))-1)))))+Tl_heat)*Celc1+Celc2","v":54.020378188282692},{"$f":"(Tl_cool-(($G33/Watts)/(1006*$N33*kgss)))*Celc1+Celc2","v":19.617236618879893},1,0.91110000000000002,0.91,0.98,0.77110000000000001,0.91110000000000002,{"$f":"(H33-G33)/H33","v":0},8715.6782547877228,0,1884.925723765745,0,51.540571811172136,38.9,752,3479,null,598,null,47,10.1,239,{"$f":"AE33","v":3479},null,598,null,47,10.1,239,null,{"$f":"(AG33*((((Tv_cool-Tr_cool)/LN((Tv_cool-Tl_cool)/(Tr_cool-Tl_cool)))/((16-18)/LN((16-27)/(18-27))))^S33))*$G$14","v":0.17138016166146744},{"$f":"((AT33/$G$14)/(IF((237.3*LN((RH*EXP(17.27*(Tl_cool/(Tl_cool+237.3))))))/(17.27-LN((RH*EXP(17.27*(Tl_cool/(Tl_cool+237.3))))))<((Tv_cool+Tr_cool)/2),1,1/(1+((2258*((0.622/((p_atm/(1*611*EXP(17.27*(((Tv_cool+Tr_cool)/2)/(((Tv_cool+Tr_cool)/2)+237.3))))))-1)*1000-(0.622/((p_atm/(RH*611*EXP(17.27*(Tl_cool/(Tl_cool+237.3))))))-1)*1000))/(1005*(((Tv_cool+Tr_cool)/2)-Tl_cool))))+-((-0.000625*$C33+0.00625)*(Tl_cool-(Tv_cool+Tr_cool)/2)-(-0.000625*$C33+0.00625)*10))))*$H$14","v":512.43237706086677},null,3394,null,645,null,49.6,17.5,349,2623.8121499999993,null,666.24714500536993,null,48,10.6,273,3967.1491228664822,null,676.58350985717811,null,48,10.6,273,null,5810.4521698584822,null,1713.5688397870406,null,51.540571811172136,38.9,752,8715.6782547877228,null,1884.925723765745,null,51.540571811172136,38.9,752]
[null,{"$f":"IF($S$7=1,NL!A33,IF(cal!$S$7=2,EN!A33,IF(cal!$S$7=3,DE!A33,IF(cal!$S$7=4,FR!A33,IF(cal!$S$7=5,NR!A33,IF(cal!$S$7=6,SP!A33,IF(cal!$S$7=7,SW!A33,IF(cal!$S$7=8,TS!A33,IF(cal!$S$7=9,ExtraTaal1!A33,IF(cal!$S$7=10,ExtraTaal2!A33,IF(cal!$S$7=11,ExtraTaal3!A33,)))))))))))","v":"Clima Canal altura 19 cm ancho 34 cm longitud 280 cm (Type 4)"},{"$f":"IF($S$7=1,NL!B33,IF(cal!$S$7=2,EN!B33,IF(cal!$S$7=3,DE!B33,IF(cal!$S$7=4,FR!B33,IF(cal!$S$7=5,NR!B33,IF(cal!$S$7=6,SP!B33,IF(cal!$S$7=7,SW!B33,IF(cal!$S$7=8,TS!B33,IF(cal!$S$7=9,ExtraTaal1!B33,IF(cal!$S$7=10,ExtraTaal2!B33,IF(cal!$S$7=11,ExtraTaal3!B33,)))))))))))","v":0},{"$f":"IF($S$7=1,NL!C33,IF(cal!$S$7=2,EN!C33,IF(cal!$S$7=3,DE!C33,IF(cal!$S$7=4,FR!C33,IF(cal!$S$7=5,NR!C33,IF(cal!$S$7=6,SP!C33,IF(cal!$S$7=7,SW!C33,IF(cal!$S$7=8,TS!C33,IF(cal!$S$7=9,ExtraTaal1!C33,IF(cal!$S$7=10,ExtraTaal2!C33,IF(cal!$S$7=11,ExtraTaal3!C33,)))))))))))","v":0},{"$f":"IF($S$7=1,NL!D33,IF(cal!$S$7=2,EN!D33,IF(cal!$S$7=3,DE!D33,IF(cal!$S$7=4,FR!D33,IF(cal!$S$7=5,NR!D33,IF(cal!$S$7=6,SP!D33,IF(cal!$S$7=7,SW!D33,IF(cal!$S$7=8,TS!D33,IF(cal!$S$7=9,ExtraTaal1!D33,IF(cal!$S$7=10,ExtraTaal2!D33,IF(cal!$S$7=11,ExtraTaal3!D33,)))))))))))","v":0},{"$f":"IF($S$7=1,NL!E33,IF(cal!$S$7=2,EN!E33,IF(cal!$S$7=3,DE!E33,IF(cal!$S$7=4,FR!E33,IF(cal!$S$7=5,NR!E33,IF(cal!$S$7=6,SP!E33,IF(cal!$S$7=7,SW!E33,IF(cal!$S$7=8,TS!E33,IF(cal!$S$7=9,ExtraTaal1!E33,IF(cal!$S$7=10,ExtraTaal2!E33,IF(cal!$S$7=11,ExtraTaal3!E33,)))))))))))","v":0},{"$f":"IF($S$7=1,NL!F33,IF(cal!$S$7=2,EN!F33,IF(cal!$S$7=3,DE!F33,IF(cal!$S$7=4,FR!F33,IF(cal!$S$7=5,NR!F33,IF(cal!$S$7=6,SP!F33,IF(cal!$S$7=7,SW!F33,IF(cal!$S$7=8,TS!F33,IF(cal!$S$7=9,ExtraTaal1!F33,IF(cal!$S$7=10,ExtraTaal2!F33,IF(cal!$S$7=11,ExtraTaal3!F33,)))))))))))","v":0},{"$f":"IF($S$7=1,NL!G33,IF(cal!$S$7=2,EN!G33,IF(cal!$S$7=3,DE!G33,IF(cal!$S$7=4,FR!G33,IF(cal!$S$7=5,NR!G33,IF(cal!$S$7=6,SP!G33,IF(cal!$S$7=7,SW!G33,IF(cal!$S$7=8,TS!G33,IF(cal!$S$7=9,ExtraTaal1!G33,IF(cal!$S$7=10,ExtraTaal2!G33,IF(cal!$S$7=11,ExtraTaal3!G33,)))))))))))","v":0},{"$f":"IF($S$7=1,NL!H33,IF(cal!$S$7=2,EN!H33,IF(cal!$S$7=3,DE!H33,IF(cal!$S$7=4,FR!H33,IF(cal!$S$7=5,NR!H33,IF(cal!$S$7=6,SP!H33,IF(cal!$S$7=7,SW!H33,IF(cal!$S$7=8,TS!H33,IF(cal!$S$7=9,ExtraTaal1!H33,IF(cal!$S$7=10,ExtraTaal2!H33,IF(cal!$S$7=11,ExtraTaal3!H33,)))))))))))","v":0},{"$f":"IF($S$7=1,NL!I33,IF(cal!$S$7=2,EN!I33,IF(cal!$S$7=3,DE!I33,IF(cal!$S$7=4,FR!I33,IF(cal!$S$7=5,NR!I33,IF(cal!$S$7=6,SP!I33,IF(cal!$S$7=7,SW!I33,IF(cal!$S$7=8,TS!I33,IF(cal!$S$7=9,ExtraTaal1!I33,IF(cal!$S$7=10,ExtraTaal2!I33,IF(cal!$S$7=11,ExtraTaal3!I33,)))))))))))","v":0},{"$f":"IF($S$7=1,NL!J33,IF(cal!$S$7=2,EN!J33,IF(cal!$S$7=3,DE!J33,IF(cal!$S$7=4,FR!J33,IF(cal!$S$7=5,NR!J33,IF(cal!$S$7=6,SP!J33,IF(cal!$S$7=7,SW!J33,IF(cal!$S$7=8,TS!J33,IF(cal!$S$7=9,ExtraTaal1!J33,IF(cal!$S$7=10,ExtraTaal2!J33,IF(cal!$S$7=11,ExtraTaal3!J33,)))))))))))","v":0},{"$f":"IF($S$7=1,NL!K33,IF(cal!$S$7=2,EN!K33,IF(cal!$S$7=3,DE!K33,IF(cal!$S$7=4,FR!K33,IF(cal!$S$7=5,NR!K33,IF(cal!$S$7=6,SP!K33,IF(cal!$S$7=7,SW!K33,IF(cal!$S$7=8,TS!K33,IF(cal!$S$7=9,ExtraTaal1!K33,IF(cal!$S$7=10,ExtraTaal2!K33,IF(cal!$S$7=11,ExtraTaal3!K33,)))))))))))","v":0},{"$f":"IF($S$7=1,NL!L33,IF(cal!$S$7=2,EN!L33,IF(cal!$S$7=3,DE!L33,IF(cal!$S$7=4,FR!L33,IF(cal!$S$7=5,NR!L33,IF(cal!$S$7=6,SP!L33,IF(cal!$S$7=7,SW!L33,IF(cal!$S$7=8,TS!L33,IF(cal!$S$7=9,ExtraTaal1!L33,IF(cal!$S$7=10,ExtraTaal2!L33,IF(cal!$S$7=11,ExtraTaal3!L33,)))))))))))","v":0},{"$f":"IF($S$7=1,NL!M33,IF(cal!$S$7=2,EN!M33,IF(cal!$S$7=3,DE!M33,IF(cal!$S$7=4,FR!M33,IF(cal!$S$7=5,NR!M33,IF(cal!$S$7=6,SP!M33,IF(cal!$S$7=7,SW!M33,IF(cal!$S$7=8,TS!M33,IF(cal!$S$7=9,ExtraTaal1!M33,IF(cal!$S$7=10,ExtraTaal2!M33,IF(cal!$S$7=11,ExtraTaal3!M33,)))))))))))","v":0},{"$f":"IF($S$7=1,NL!N33,IF(cal!$S$7=2,EN!N33,IF(cal!$S$7=3,DE!N33,IF(cal!$S$7=4,FR!N33,IF(cal!$S$7=5,NR!N33,IF(cal!$S$7=6,SP!N33,IF(cal!$S$7=7,SW!N33,IF(cal!$S$7=8,TS!N33,IF(cal!$S$7=9,ExtraTaal1!N33,IF(cal!$S$7=10,ExtraTaal2!N33,IF(cal!$S$7=11,ExtraTaal3!N33,)))))))))))","v":0},{"$f":"IF($S$7=1,NL!O33,IF(cal!$S$7=2,EN!O33,IF(cal!$S$7=3,DE!O33,IF(cal!$S$7=4,FR!O33,IF(cal!$S$7=5,NR!O33,IF(cal!$S$7=6,SP!O33,IF(cal!$S$7=7,SW!O33,IF(cal!$S$7=8,TS!O33,IF(cal!$S$7=9,ExtraTaal1!O33,IF(cal!$S$7=10,ExtraTaal2!O33,IF(cal!$S$7=11,ExtraTaal3!O33,)))))))))))","v":0},"n-value","n-value","n-value","n-value","n-value","n-value",null,"H",19,"B",34,"L",200,0,"H",{"$f":"AF28","v":8},"B",{"$f":"AH28","v":18},"L",{"$f":"144*IF($X$4=1,1,IF($X$4=2,1/2.54))","v":144},null,"H",{"$f":"AM28","v":10},"B",{"$f":"AO28","v":18},"L",{"$f":"AJ34","v":144},null,null,null,null,null,"H",{"$f":"AX22","v":13},"B",{"$f":"AZ22","v":27},"L",{"$f":"IF($X$4=1,160.8,160.8/2.54)","v":160.80000000000001},null,"H",{"$f":"BE22","v":13},"B",{"$f":"BG22","v":32},"L",{"$f":"IF($X$4=1,120,120/2.54)","v":120},null,"H",{"$f":"BL22","v":13},"B",{"$f":"BN22","v":32},"L",{"$f":"IF($X$4=1,120,120/2.54)","v":120},null,null,"H",{"$f":"BT28","v":19},"B",{"$f":"BV28","v":34},"L",{"$f":"200*IF($X$4=1,1,IF($X$4=2,1/2.54))","v":200},null,"H",{"$f":"CA28","v":19},"B",{"$f":"CC28","v":34},"L",{"$f":"BX34","v":200}]
[null,0.2,2,{"$f":"(X35*($T$11^$Q35))*Watts*CF_Altit","v":4495.2480092804572},{"$f":"ROUND(((D35/Watts)/(($S$9-$S$10)*1.163))*$E$14,IF($X$4=1,0,IF($X$4=2,2)))","v":387},{"$f":"($Y$36*(E35/$E$14)^$Y$38)*$F$14","v":5.6635321830477565},{"$f":"(Z35*($W$11^R35))*Watts*CF_Altit","v":510.3278064259822},{"$f":"((G35/Watts)/(IF((237.3*LN((RH*EXP(17.27*(Tl_cool/(Tl_cool+237.3))))))/(17.27-LN((RH*EXP(17.27*(Tl_cool/(Tl_cool+237.3))))))<Tavg_cold,1,IF(1/(1+((2258*((0.622/(($Z$11/(1*611*EXP(17.27*(Tavg_cold/(Tavg_cold+237.3))))))-1)*1000-(0.622/(($Z$11/(RH*611*EXP(17.27*(Tl_cool/(Tl_cool+237.3))))))-1)*1000))/(1005*(Tavg_cold-Tl_cool))))*1.039+((-0.000729*$C35+0.001448)*(Tl_cool-Tavg_cold)+(0.016908*$C35-0.033574))*1.039>1,1,1/(1+((2258*((0.622/(($Z$11/(1*611*EXP(17.27*(Tavg_cold/(Tavg_cold+237.3))))))-1)*1000-(0.622/(($Z$11/(RH*611*EXP(17.27*(Tl_cool/(Tl_cool+237.3))))))-1)*1000))/(1005*(Tavg_cold-Tl_cool))))*1.039+((-0.000729*$C35+0.001448)*(Tl_cool-Tavg_cold)+(0.016908*$C35-0.033574))*1.039))))*Watts","v":510.3278064259822},{"$f":"ROUND(((H35/Watts)/((Tr_cool-Tv_cool)*1.163))*$I$14,IF($X$4=1,0,IF($X$4=2,2)))","v":146},{"$f":"($AA$36*(I35/$I$14)^$AA$38)*$J$14","v":0.80606702330820112},{"$f":"L35-8","v":22.520451931056087},{"$f":"AB35","v":30.520451931056087},6.1,{"$f":"AD35*Cubics","v":276},{"$f":"((($D35/Watts)/(((p_atm*0.028964)/(8.31447*(20+273.15)))*(($N35/3600)/Cubics)*(1005+1870*((0.622)/(((p_atm)/($E$12*Pvs_Heat_in))-1)))))+Tl_heat)*Celc1+Celc2","v":67.807976625367687},{"$f":"(Tl_cool-(($G35/Watts)/(1006*$N35*kgss)))*Celc1+Celc2","v":20.504361167682809},1,0.87660000000000005,0.6,1.1599999999999999,0.78069999999999995,0.87660000000000005,{"$f":"(H35-G35)/H35","v":0},{"$f":"IF($X$16=1,AE35,IF($X$16=2,AL35,IF($X$16=3,BK35,IF($X$16=4,BD35,IF($X$16=5,BZ35,IF($X$16=6,BS35,IF($X$16=7,AW35,)))))))","v":4495.2480092804572},"a",592.1781267092075,"a",30.520451931056087,6.1,276,1219,"a",132,"a",26,1.2,84,{"$f":"AE35","v":1219},"a",132,"a",{"$f":"AI35","v":26},1.2,84,null,{"$f":"(AG35*((((Tv_cool-Tr_cool)/LN((Tv_cool-Tl_cool)/(Tr_cool-Tl_cool)))/((16-18)/LN((16-27)/(18-27))))^S35))*$G$14","v":3.9873052567414712E-2},{"$f":"((AT35/$G$14)/(IF((237.3*LN((RH*EXP(17.27*(Tl_cool/(Tl_cool+237.3))))))/(17.27-LN((RH*EXP(17.27*(Tl_cool/(Tl_cool+237.3))))))<((Tv_cool+Tr_cool)/2),1,1/(1+((2258*((0.622/((p_atm/(1*611*EXP(17.27*(((Tv_cool+Tr_cool)/2)/(((Tv_cool+Tr_cool)/2)+237.3))))))-1)*1000-(0.622/((p_atm/(RH*611*EXP(17.27*(Tl_cool/(Tl_cool+237.3))))))-1)*1000))/(1005*(((Tv_cool+Tr_cool)/2)-Tl_cool))))+-((-0.000625*$C35+0.00625)*(Tl_cool-(Tv_cool+Tr_cool)/2)-(-0.000625*$C35+0.00625)*10))))*$H$14","v":119.22175186270195},null,1367,"a",156,"a",30.1,2,104,829.01222999999993,"a",199.65770316445665,"a",29.5,1.992,79,966.35281858659005,"a",207.94655204324866,"a",{"$f":"BH35","v":29.5},1.992,79,null,2996.8320061869708,"a",538.34375155382486,"a",30.520451931056087,6.1,276,4495.2480092804572,"a",592.1781267092075,"a",30.520451931056087,6.1,276]
[null,0.4,4,{"$f":"(X36*($T$11^$Q36))*Watts*CF_Altit","v":7094.2280785769608},{"$f":"ROUND(((D36/Watts)/(($S$9-$S$10)*1.163))*$E$14,IF($X$4=1,0,IF($X$4=2,2)))","v":610},{"$f":"($Y$36*(E36/$E$14)^$Y$38)*$F$14","v":14.071004849548773},{"$f":"(Z36*($W$11^R36))*Watts*CF_Altit","v":996.91153897865331},{"$f":"((G36/Watts)/(IF((237.3*LN((RH*EXP(17.27*(Tl_cool/(Tl_cool+237.3))))))/(17.27-LN((RH*EXP(17.27*(Tl_cool/(Tl_cool+237.3))))))<Tavg_cold,1,IF(1/(1+((2258*((0.622/(($Z$11/(1*611*EXP(17.27*(Tavg_cold/(Tavg_cold+237.3))))))-1)*1000-(0.622/(($Z$11/(RH*611*EXP(17.27*(Tl_cool/(Tl_cool+237.3))))))-1)*1000))/(1005*(Tavg_cold-Tl_cool))))*1.039+((-0.000729*$C36+0.001448)*(Tl_cool-Tavg_cold)+(0.016908*$C36-0.033574))*1.039>1,1,1/(1+((2258*((0.622/(($Z$11/(1*611*EXP(17.27*(Tavg_cold/(Tavg_cold+237.3))))))-1)*1000-(0.622/(($Z$11/(RH*611*EXP(17.27*(Tl_cool/(Tl_cool+237.3))))))-1)*1000))/(1005*(Tavg_cold-Tl_cool))))*1.039+((-0.000729*$C36+0.001448)*(Tl_cool-Tavg_cold)+(0.016908*$C36-0.033574))*1.039))))*Watts","v":996.91153897865331},{"$f":"ROUND(((H36/Watts)/((Tr_cool-Tv_cool)*1.163))*$I$14,IF($X$4=1,0,IF($X$4=2,2)))","v":286},{"$f":"($AA$36*(I36/$I$14)^$AA$38)*$J$14","v":3.0931252692117481},{"$f":"L36-8","v":26.143327309406075},34.143327309406075,12.1,{"$f":"AD36*Cubics","v":513},{"$f":"((($D36/Watts)/(((p_atm*0.028964)/(8.31447*(20+273.15)))*(($N36/3600)/Cubics)*(1005+1870*((0.622)/(((p_atm)/($E$12*Pvs_Heat_in))-1)))))+Tl_heat)*Celc1+Celc2","v":60.592291619664593},{"$f":"(Tl_cool-(($G36/Watts)/(1006*$N36*kgss)))*Celc1+Celc2","v":20.224131581794108},1,0.87749999999999995,0.68,1.04,0.85870000000000002,0.87749999999999995,{"$f":"(H36-G36)/H36","v":0},7094.2280785769608,3.7815116499727958E-5,1156.9806077823214,3.7815116499727958E-5,34.143327309406075,12.1,513,2188,7.3989525167788965E-4,290,{"$f":"AF36","v":7.3989525167788965E-4},30,2.5,150,{"$f":"AE36","v":2188},{"$f":"AH36","v":7.3989525167788965E-4},290,{"$f":"AM36","v":7.3989525167788965E-4},30,2.5,150,null,{"$f":"(AG36*((((Tv_cool-Tr_cool)/LN((Tv_cool-Tl_cool)/(Tr_cool-Tl_cool)))/((16-18)/LN((16-27)/(18-27))))^S36))*$G$14","v":8.6418706391313702E-2},{"$f":"((AT36/$G$14)/(IF((237.3*LN((RH*EXP(17.27*(Tl_cool/(Tl_cool+237.3))))))/(17.27-LN((RH*EXP(17.27*(Tl_cool/(Tl_cool+237.3))))))<((Tv_cool+Tr_cool)/2),1,1/(1+((2258*((0.622/((p_atm/(1*611*EXP(17.27*(((Tv_cool+Tr_cool)/2)/(((Tv_cool+Tr_cool)/2)+237.3))))))-1)*1000-(0.622/((p_atm/(RH*611*EXP(17.27*(Tl_cool/(Tl_cool+237.3))))))-1)*1000))/(1005*(((Tv_cool+Tr_cool)/2)-Tl_cool))))+-((-0.000625*$C36+0.00625)*(Tl_cool-(Tv_cool+Tr_cool)/2)-(-0.000625*$C36+0.00625)*10))))*$H$14","v":258.39480316339677},null,2229,8.7999999999999998E-5,317,6.7268900000000001E-6,34.9,3.6,156,1653.3317699999996,5.6280499999999998E-5,362.58532156483511,1.5022728308696918E-5,34,3.4320000000000004,129,2137.2546444146683,4.3073444316382473E-5,377.57876787215622,{"$f":"BL36","v":4.3073444316382473E-5},34,3.4320000000000004,129,null,4729.4853857179733,4.1508748845793605E-5,1051.8005525293829,1.2302938988853249E-4,34.143327309406075,12.1,513,7094.2280785769608,3.7815116499727958E-5,1156.9806077823214,3.7815116499727958E-5,34.143327309406075,12.1,513]
[null,0.6,6,{"$f":"(X37*($T$11^$Q37))*Watts*CF_Altit","v":9264.3795168313045},{"$f":"ROUND(((D37/Watts)/(($S$9-$S$10)*1.163))*$E$14,IF($X$4=1,0,IF($X$4=2,2)))","v":797},{"$f":"($Y$36*(E37/$E$14)^$Y$38)*$F$14","v":24.020502336675698},{"$f":"(Z37*($W$11^R37))*Watts*CF_Altit","v":1473.9243785044616},{"$f":"((G37/Watts)/(IF((237.3*LN((RH*EXP(17.27*(Tl_cool/(Tl_cool+237.3))))))/(17.27-LN((RH*EXP(17.27*(Tl_cool/(Tl_cool+237.3))))))<Tavg_cold,1,IF(1/(1+((2258*((0.622/(($Z$11/(1*611*EXP(17.27*(Tavg_cold/(Tavg_cold+237.3))))))-1)*1000-(0.622/(($Z$11/(RH*611*EXP(17.27*(Tl_cool/(Tl_cool+237.3))))))-1)*1000))/(1005*(Tavg_cold-Tl_cool))))*1.039+((-0.000729*$C37+0.001448)*(Tl_cool-Tavg_cold)+(0.016908*$C37-0.033574))*1.039>1,1,1/(1+((2258*((0.622/(($Z$11/(1*611*EXP(17.27*(Tavg_cold/(Tavg_cold+237.3))))))-1)*1000-(0.622/(($Z$11/(RH*611*EXP(17.27*(Tl_cool/(Tl_cool+237.3))))))-1)*1000))/(1005*(Tavg_cold-Tl_cool))))*1.039+((-0.000729*$C37+0.001448)*(Tl_cool-Tavg_cold)+(0.016908*$C37-0.033574))*1.039))))*Watts","v":1473.9243785044616},{"$f":"ROUND(((H37/Watts)/((Tr_cool-Tv_cool)*1.163))*$I$14,IF($X$4=1,0,IF($X$4=2,2)))","v":422},{"$f":"($AA$36*(I37/$I$14)^$AA$38)*$J$14","v":6.7342672067375542},{"$f":"L37-8","v":32.123455182150146},40.123455182150146,21.7,{"$f":"AD37*Cubics","v":732},{"$f":"((($D37/Watts)/(((p_atm*0.028964)/(8.31447*(20+273.15)))*(($N37/3600)/Cubics)*(1005+1870*((0.622)/(((p_atm)/($E$12*Pvs_Heat_in))-1)))))+Tl_heat)*Celc1+Celc2","v":57.150190473346498},{"$f":"(Tl_cool-(($G37/Watts)/(1006*$N37*kgss)))*Celc1+Celc2","v":20.015303181843812},1,0.88200000000000001,0.79,0.95,0.8831,0.88200000000000001,{"$f":"(H37-G37)/H37","v":0},{"$f":"IF($X$16=1,AE37,IF($X$16=2,AL37,IF($X$16=3,BK37,IF($X$16=4,BD37,IF($X$16=5,BZ37,IF($X$16=6,BS37,IF($X$16=7,AW37,)))))))","v":9264.3795168313045},"b",1711.8917431560951,"b",40.123455182150146,21.7,732,3082,"b",458,"b",40,5.4,196,{"$f":"AE37","v":3082},"b",458,"b",40,5.4,196,null,{"$f":"(AG37*((((Tv_cool-Tr_cool)/LN((Tv_cool-Tl_cool)/(Tr_cool-Tl_cool)))/((16-18)/LN((16-27)/(18-27))))^S37))*$G$14","v":0.13395796104749502},{"$f":"((AT37/$G$14)/(IF((237.3*LN((RH*EXP(17.27*(Tl_cool/(Tl_cool+237.3))))))/(17.27-LN((RH*EXP(17.27*(Tl_cool/(Tl_cool+237.3))))))<((Tv_cool+Tr_cool)/2),1,1/(1+((2258*((0.622/((p_atm/(1*611*EXP(17.27*(((Tv_cool+Tr_cool)/2)/(((Tv_cool+Tr_cool)/2)+237.3))))))-1)*1000-(0.622/((p_atm/(RH*611*EXP(17.27*(Tl_cool/(Tl_cool+237.3))))))-1)*1000))/(1005*(((Tv_cool+Tr_cool)/2)-Tl_cool))))+-((-0.000625*$C37+0.00625)*(Tl_cool-(Tv_cool+Tr_cool)/2)-(-0.000625*$C37+0.00625)*10))))*$H$14","v":400.5387539626102},null,2967,"b",480,"b",40,7.2,246,2331.9812699999998,"b",521.25612708716415,"b",39,6.4,218,3186.0571968657455,"b",539.2383212015659,"b",39,6.4,218,null,6176.2530112208697,"b",1556.2652210509953,"b",40.123455182150146,21.7,732,9264.3795168313045,"b",1711.8917431560951,"b",40.123455182150146,21.7,732]
[null,0.8,8,{"$f":"(X38*($T$11^$Q38))*Watts*CF_Altit","v":11195.838789532243},{"$f":"ROUND(((D38/Watts)/(($S$9-$S$10)*1.163))*$E$14,IF($X$4=1,0,IF($X$4=2,2)))","v":963},{"$f":"($Y$36*(E38/$E$14)^$Y$38)*$F$14","v":35.068566773236221},{"$f":"(Z38*($W$11^R38))*Watts*CF_Altit","v":1941.9615936153275},{"$f":"((G38/Watts)/(IF((237.3*LN((RH*EXP(17.27*(Tl_cool/(Tl_cool+237.3))))))/(17.27-LN((RH*EXP(17.27*(Tl_cool/(Tl_cool+237.3))))))<Tavg_cold,1,IF(1/(1+((2258*((0.622/(($Z$11/(1*611*EXP(17.27*(Tavg_cold/(Tavg_cold+237.3))))))-1)*1000-(0.622/(($Z$11/(RH*611*EXP(17.27*(Tl_cool/(Tl_cool+237.3))))))-1)*1000))/(1005*(Tavg_cold-Tl_cool))))*1.039+((-0.000729*$C38+0.001448)*(Tl_cool-Tavg_cold)+(0.016908*$C38-0.033574))*1.039>1,1,1/(1+((2258*((0.622/(($Z$11/(1*611*EXP(17.27*(Tavg_cold/(Tavg_cold+237.3))))))-1)*1000-(0.622/(($Z$11/(RH*611*EXP(17.27*(Tl_cool/(Tl_cool+237.3))))))-1)*1000))/(1005*(Tavg_cold-Tl_cool))))*1.039+((-0.000729*$C38+0.001448)*(Tl_cool-Tavg_cold)+(0.016908*$C38-0.033574))*1.039))))*Watts","v":1941.9615936153275},{"$f":"ROUND(((H38/Watts)/((Tr_cool-Tv_cool)*1.163))*$I$14,IF($X$4=1,0,IF($X$4=2,2)))","v":557},{"$f":"($AA$36*(I38/$I$14)^$AA$38)*$J$14","v":11.732102078924099},{"$f":"L38-8","v":40.132836242894129},48.132836242894129,37,{"$f":"AD38*Cubics","v":969},{"$f":"((($D38/Watts)/(((p_atm*0.028964)/(8.31447*(20+273.15)))*(($N38/3600)/Cubics)*(1005+1870*((0.622)/(((p_atm)/($E$12*Pvs_Heat_in))-1)))))+Tl_heat)*Celc1+Celc2","v":53.914752141495711},{"$f":"(Tl_cool-(($G38/Watts)/(1006*$N38*kgss)))*Celc1+Celc2","v":20.04344861490879},1,0.89500000000000002,0.87,0.95,0.85389999999999999,0.89500000000000002,{"$f":"(H38-G38)/H38","v":0},11195.838789532243,2,2260.4754657574149,2,48.132836242894129,37,969,3929,1.8235155847906248,634,{"$f":"AF38","v":1.8235155847906248},45,9.1,250,{"$f":"AE38","v":3929},{"$f":"AH38","v":1.8235155847906248},634,{"$f":"AM38","v":1.8235155847906248},45,9.1,250,null,{"$f":"(AG38*((((Tv_cool-Tr_cool)/LN((Tv_cool-Tl_cool)/(Tr_cool-Tl_cool)))/((16-18)/LN((16-27)/(18-27))))^S38))*$G$14","v":0.18293487902499042},{"$f":"((AT38/$G$14)/(IF((237.3*LN((RH*EXP(17.27*(Tl_cool/(Tl_cool+237.3))))))/(17.27-LN((RH*EXP(17.27*(Tl_cool/(Tl_cool+237.3))))))<((Tv_cool+Tr_cool)/2),1,1/(1+((2258*((0.622/((p_atm/(1*611*EXP(17.27*(((Tv_cool+Tr_cool)/2)/(((Tv_cool+Tr_cool)/2)+237.3))))))-1)*1000-(0.622/((p_atm/(RH*611*EXP(17.27*(Tl_cool/(Tl_cool+237.3))))))-1)*1000))/(1005*(((Tv_cool+Tr_cool)/2)-Tl_cool))))+-((-0.000625*$C38+0.00625)*(Tl_cool-(Tv_cool+Tr_cool)/2)-(-0.000625*$C38+0.00625)*10))))*$H$14","v":546.98136585545376},null,3635,1.8,643,2,47,13,336,2864.9607299999993,1.87032,675.67011973144383,1.9341411629252601,46.5,12.3,285,4112.7604759398218,1.862013136789098,692.9252120314776,{"$f":"BL38","v":1.862013136789098},46.5,12.3,285,null,7463.8925263548281,2,2054.9776961431044,2,48.132836242894129,37,969,11195.838789532243,2,2260.4754657574149,2,48.132836242894129,37,969]
[null,1,10,{"$f":"(X39*($T$11^$Q39))*Watts*CF_Altit","v":12967.228622976858},{"$f":"ROUND(((D39/Watts)/(($S$9-$S$10)*1.163))*$E$14,IF($X$4=1,0,IF($X$4=2,2)))","v":1115},{"$f":"($Y$36*(E39/$E$14)^$Y$38)*$F$14","v":47.012698210374289},{"$f":"(Z39*($W$11^R39))*Watts*CF_Altit","v":2402.6722392261718},{"$f":"((G39/Watts)/(IF((237.3*LN((RH*EXP(17.27*(Tl_cool/(Tl_cool+237.3))))))/(17.27-LN((RH*EXP(17.27*(Tl_cool/(Tl_cool+237.3))))))<Tavg_cold,1,IF(1/(1+((2258*((0.622/(($Z$11/(1*611*EXP(17.27*(Tavg_cold/(Tavg_cold+237.3))))))-1)*1000-(0.622/(($Z$11/(RH*611*EXP(17.27*(Tl_cool/(Tl_cool+237.3))))))-1)*1000))/(1005*(Tavg_cold-Tl_cool))))*1.039+((-0.000729*$C39+0.001448)*(Tl_cool-Tavg_cold)+(0.016908*$C39-0.033574))*1.039>1,1,1/(1+((2258*((0.622/(($Z$11/(1*611*EXP(17.27*(Tavg_cold/(Tavg_cold+237.3))))))-1)*1000-(0.622/(($Z$11/(RH*611*EXP(17.27*(Tl_cool/(Tl_cool+237.3))))))-1)*1000))/(1005*(Tavg_cold-Tl_cool))))*1.039+((-0.000729*$C39+0.001448)*(Tl_cool-Tavg_cold)+(0.016908*$C39-0.033574))*1.039))))*Watts","v":2402.6722392261718},{"$f":"ROUND(((H39/Watts)/((Tr_cool-Tv_cool)*1.163))*$I$14,IF($X$4=1,0,IF($X$4=2,2)))","v":689},{"$f":"($AA$36*(I39/$I$14)^$AA$38)*$J$14","v":17.951629919867358},{"$f":"L39-8","v":45.131608091109797},53.131608091109797,53.8,{"$f":"AD39*Cubics","v":1103},{"$f":"((($D39/Watts)/(((p_atm*0.028964)/(8.31447*(20+273.15)))*(($N39/3600)/Cubics)*(1005+1870*((0.622)/(((p_atm)/($E$12*Pvs_Heat_in))-1)))))+Tl_heat)*Celc1+Celc2","v":54.508608191692367},{"$f":"(Tl_cool-(($G39/Watts)/(1006*$N39*kgss)))*Celc1+Celc2","v":19.525636914429793},1,0.91110000000000002,0.91,0.98,0.77110000000000001,0.91110000000000002,{"$f":"(H39-G39)/H39","v":0},12967.228622976858,0,2804.4016865783037,0,53.131608091109797,53.8,1103,4744,null,816,null,49,14.1,320,{"$f":"AE39","v":4744},null,816,null,49,14.1,320,null,{"$f":"(AG39*((((Tv_cool-Tr_cool)/LN((Tv_cool-Tl_cool)/(Tr_cool-Tl_cool)))/((16-18)/LN((16-27)/(18-27))))^S39))*$G$14","v":0.23385654166514622},{"$f":"((AT39/$G$14)/(IF((237.3*LN((RH*EXP(17.27*(Tl_cool/(Tl_cool+237.3))))))/(17.27-LN((RH*EXP(17.27*(Tl_cool/(Tl_cool+237.3))))))<((Tv_cool+Tr_cool)/2),1,1/(1+((2258*((0.622/((p_atm/(1*611*EXP(17.27*(((Tv_cool+Tr_cool)/2)/(((Tv_cool+Tr_cool)/2)+237.3))))))-1)*1000-(0.622/((p_atm/(RH*611*EXP(17.27*(Tl_cool/(Tl_cool+237.3))))))-1)*1000))/(1005*(((Tv_cool+Tr_cool)/2)-Tl_cool))))+-((-0.000625*$C39+0.00625)*(Tl_cool-(Tv_cool+Tr_cool)/2)-(-0.000625*$C39+0.00625)*10))))*$H$14","v":699.23882889910919},null,4255,null,808,null,50.1,19.7,404,3252.2701499999989,null,825.82729949767406,null,49.5,19.100000000000001,339,4917.3644816368969,null,838.63944036189139,null,49.5,19.100000000000001,339,null,8644.8190819845713,null,2549.4560787075484,null,53.131608091109797,53.8,1103,12967.228622976858,null,2804.4016865783037,null,53.131608091109797,53.8,1103]
[null,{"$f":"IF($S$7=1,NL!A39,IF(cal!$S$7=2,EN!A39,IF(cal!$S$7=3,DE!A39,IF(cal!$S$7=4,FR!A39,IF(cal!$S$7=5,NR!A39,IF(cal!$S$7=6,SP!A39,IF(cal!$S$7=7,SW!A39,IF(cal!$S$7=8,TS!A39,IF(cal!$S$7=9,ExtraTaal1!A39,IF(cal!$S$7=10,ExtraTaal2!A39,IF(cal!$S$7=11,ExtraTaal3!A39,)))))))))))","v":"Clima Canal altura 0 cm ancho 0 cm longitud 0 cm (Type 5)"},{"$f":"IF($S$7=1,NL!B39,IF(cal!$S$7=2,EN!B39,IF(cal!$S$7=3,DE!B39,IF(cal!$S$7=4,FR!B39,IF(cal!$S$7=5,NR!B39,IF(cal!$S$7=6,SP!B39,IF(cal!$S$7=7,SW!B39,IF(cal!$S$7=8,TS!B39,IF(cal!$S$7=9,ExtraTaal1!B39,IF(cal!$S$7=10,ExtraTaal2!B39,IF(cal!$S$7=11,ExtraTaal3!B39,)))))))))))","v":0},{"$f":"IF($S$7=1,NL!C39,IF(cal!$S$7=2,EN!C39,IF(cal!$S$7=3,DE!C39,IF(cal!$S$7=4,FR!C39,IF(cal!$S$7=5,NR!C39,IF(cal!$S$7=6,SP!C39,IF(cal!$S$7=7,SW!C39,IF(cal!$S$7=8,TS!C39,IF(cal!$S$7=9,ExtraTaal1!C39,IF(cal!$S$7=10,ExtraTaal2!C39,IF(cal!$S$7=11,ExtraTaal3!C39,)))))))))))","v":0},{"$f":"IF($S$7=1,NL!D39,IF(cal!$S$7=2,EN!D39,IF(cal!$S$7=3,DE!D39,IF(cal!$S$7=4,FR!D39,IF(cal!$S$7=5,NR!D39,IF(cal!$S$7=6,SP!D39,IF(cal!$S$7=7,SW!D39,IF(cal!$S$7=8,TS!D39,IF(cal!$S$7=9,ExtraTaal1!D39,IF(cal!$S$7=10,ExtraTaal2!D39,IF(cal!$S$7=11,ExtraTaal3!D39,)))))))))))","v":0},{"$f":"IF($S$7=1,NL!E39,IF(cal!$S$7=2,EN!E39,IF(cal!$S$7=3,DE!E39,IF(cal!$S$7=4,FR!E39,IF(cal!$S$7=5,NR!E39,IF(cal!$S$7=6,SP!E39,IF(cal!$S$7=7,SW!E39,IF(cal!$S$7=8,TS!E39,IF(cal!$S$7=9,ExtraTaal1!E39,IF(cal!$S$7=10,ExtraTaal2!E39,IF(cal!$S$7=11,ExtraTaal3!E39,)))))))))))","v":0},{"$f":"IF($S$7=1,NL!F39,IF(cal!$S$7=2,EN!F39,IF(cal!$S$7=3,DE!F39,IF(cal!$S$7=4,FR!F39,IF(cal!$S$7=5,NR!F39,IF(cal!$S$7=6,SP!F39,IF(cal!$S$7=7,SW!F39,IF(cal!$S$7=8,TS!F39,IF(cal!$S$7=9,ExtraTaal1!F39,IF(cal!$S$7=10,ExtraTaal2!F39,IF(cal!$S$7=11,ExtraTaal3!F39,)))))))))))","v":0},{"$f":"IF($S$7=1,NL!G39,IF(cal!$S$7=2,EN!G39,IF(cal!$S$7=3,DE!G39,IF(cal!$S$7=4,FR!G39,IF(cal!$S$7=5,NR!G39,IF(cal!$S$7=6,SP!G39,IF(cal!$S$7=7,SW!G39,IF(cal!$S$7=8,TS!G39,IF(cal!$S$7=9,ExtraTaal1!G39,IF(cal!$S$7=10,ExtraTaal2!G39,IF(cal!$S$7=11,ExtraTaal3!G39,)))))))))))","v":0},{"$f":"IF($S$7=1,NL!H39,IF(cal!$S$7=2,EN!H39,IF(cal!$S$7=3,DE!H39,IF(cal!$S$7=4,FR!H39,IF(cal!$S$7=5,NR!H39,IF(cal!$S$7=6,SP!H39,IF(cal!$S$7=7,SW!H39,IF(cal!$S$7=8,TS!H39,IF(cal!$S$7=9,ExtraTaal1!H39,IF(cal!$S$7=10,ExtraTaal2!H39,IF(cal!$S$7=11,ExtraTaal3!H39,)))))))))))","v":0},{"$f":"IF($S$7=1,NL!I39,IF(cal!$S$7=2,EN!I39,IF(cal!$S$7=3,DE!I39,IF(cal!$S$7=4,FR!I39,IF(cal!$S$7=5,NR!I39,IF(cal!$S$7=6,SP!I39,IF(cal!$S$7=7,SW!I39,IF(cal!$S$7=8,TS!I39,IF(cal!$S$7=9,ExtraTaal1!I39,IF(cal!$S$7=10,ExtraTaal2!I39,IF(cal!$S$7=11,ExtraTaal3!I39,)))))))))))","v":0},{"$f":"IF($S$7=1,NL!J39,IF(cal!$S$7=2,EN!J39,IF(cal!$S$7=3,DE!J39,IF(cal!$S$7=4,FR!J39,IF(cal!$S$7=5,NR!J39,IF(cal!$S$7=6,SP!J39,IF(cal!$S$7=7,SW!J39,IF(cal!$S$7=8,TS!J39,IF(cal!$S$7=9,ExtraTaal1!J39,IF(cal!$S$7=10,ExtraTaal2!J39,IF(cal!$S$7=11,ExtraTaal3!J39,)))))))))))","v":0},{"$f":"IF($S$7=1,NL!K39,IF(cal!$S$7=2,EN!K39,IF(cal!$S$7=3,DE!K39,IF(cal!$S$7=4,FR!K39,IF(cal!$S$7=5,NR!K39,IF(cal!$S$7=6,SP!K39,IF(cal!$S$7=7,SW!K39,IF(cal!$S$7=8,TS!K39,IF(cal!$S$7=9,ExtraTaal1!K39,IF(cal!$S$7=10,ExtraTaal2!K39,IF(cal!$S$7=11,ExtraTaal3!K39,)))))))))))","v":0},{"$f":"IF($S$7=1,NL!L39,IF(cal!$S$7=2,EN!L39,IF(cal!$S$7=3,DE!L39,IF(cal!$S$7=4,FR!L39,IF(cal!$S$7=5,NR!L39,IF(cal!$S$7=6,SP!L39,IF(cal!$S$7=7,SW!L39,IF(cal!$S$7=8,TS!L39,IF(cal!$S$7=9,ExtraTaal1!L39,IF(cal!$S$7=10,ExtraTaal2!L39,IF(cal!$S$7=11,ExtraTaal3!L39,)))))))))))","v":0},{"$f":"IF($S$7=1,NL!M39,IF(cal!$S$7=2,EN!M39,IF(cal!$S$7=3,DE!M39,IF(cal!$S$7=4,FR!M39,IF(cal!$S$7=5,NR!M39,IF(cal!$S$7=6,SP!M39,IF(cal!$S$7=7,SW!M39,IF(cal!$S$7=8,TS!M39,IF(cal!$S$7=9,ExtraTaal1!M39,IF(cal!$S$7=10,ExtraTaal2!M39,IF(cal!$S$7=11,ExtraTaal3!M39,)))))))))))","v":0},{"$f":"IF($S$7=1,NL!N39,IF(cal!$S$7=2,EN!N39,IF(cal!$S$7=3,DE!N39,IF(cal!$S$7=4,FR!N39,IF(cal!$S$7=5,NR!N39,IF(cal!$S$7=6,SP!N39,IF(cal!$S$7=7,SW!N39,IF(cal!$S$7=8,TS!N39,IF(cal!$S$7=9,ExtraTaal1!N39,IF(cal!$S$7=10,ExtraTaal2!N39,IF(cal!$S$7=11,ExtraTaal3!N39,)))))))))))","v":0},{"$f":"IF($S$7=1,NL!O39,IF(cal!$S$7=2,EN!O39,IF(cal!$S$7=3,DE!O39,IF(cal!$S$7=4,FR!O39,IF(cal!$S$7=5,NR!O39,IF(cal!$S$7=6,SP!O39,IF(cal!$S$7=7,SW!O39,IF(cal!$S$7=8,TS!O39,IF(cal!$S$7=9,ExtraTaal1!O39,IF(cal!$S$7=10,ExtraTaal2!O39,IF(cal!$S$7=11,ExtraTaal3!O39,)))))))))))","v":0},"n-value","n-value","n-value","n-value","n-value","n-value",null,"H",19,"B",34,"L",280,0,"H",{"$f":"AF34","v":8},"B",{"$f":"AH34","v":18},"L",{"$f":"180*IF($X$4=1,1,IF($X$4=2,1/2.54))","v":180},null,"H",{"$f":"AM34","v":10},"B",{"$f":"AO34","v":18},"L",{"$f":"AJ40","v":180},null,null,null,null,null,"H",{"$f":"AX22","v":13},"B",{"$f":"AZ22","v":27},"L",{"$f":"IF($X$4=1,180.3,180.3/2.54)","v":180.3},null,"H",{"$f":"BE22","v":13},"B",{"$f":"BG22","v":32},"L",{"$f":"IF($X$4=1,140,140/2.54)","v":140},null,"H",{"$f":"BL22","v":13},"B",{"$f":"BN22","v":32},"L",{"$f":"IF($X$4=1,140,140/2.54)","v":140},null,null,"H",{"$f":"BT34","v":19},"B",{"$f":"BV34","v":34},"L",{"$f":"280*IF($X$4=1,1,IF($X$4=2,1/2.54))","v":280},null,"H",{"$f":"CA34","v":19},"B",{"$f":"CC34","v":34},"L",{"$f":"BX40","v":280}]
[null,0.2,2,{"$f":"(X41*($T$11^$Q41))*Watts*CF_Altit","v":0},{"$f":"ROUND(((D41/Watts)/(($S$9-$S$10)*1.163))*$E$14,IF($X$4=1,0,IF($X$4=2,2)))","v":0},{"$f":"($Y$42*(E41/$E$14)^$Y$44)*$F$14","v":{"$error":"#NUM!"}},{"$f":"(Z41*($W$11^R41))*Watts*CF_Altit","v":0},{"$f":"((G41/Watts)/(IF((237.3*LN((RH*EXP(17.27*(Tl_cool/(Tl_cool+237.3))))))/(17.27-LN((RH*EXP(17.27*(Tl_cool/(Tl_cool+237.3))))))<Tavg_cold,1,IF(1/(1+((2258*((0.622/(($Z$11/(1*611*EXP(17.27*(Tavg_cold/(Tavg_cold+237.3))))))-1)*1000-(0.622/(($Z$11/(RH*611*EXP(17.27*(Tl_cool/(Tl_cool+237.3))))))-1)*1000))/(1005*(Tavg_cold-Tl_cool))))*1.039+((-0.000729*$C41+0.001448)*(Tl_cool-Tavg_cold)+(0.016908*$C41-0.033574))*1.039>1,1,1/(1+((2258*((0.622/(($Z$11/(1*611*EXP(17.27*(Tavg_cold/(Tavg_cold+237.3))))))-1)*1000-(0.622/(($Z$11/(RH*611*EXP(17.27*(Tl_cool/(Tl_cool+237.3))))))-1)*1000))/(1005*(Tavg_cold-Tl_cool))))*1.039+((-0.000729*$C41+0.001448)*(Tl_cool-Tavg_cold)+(0.016908*$C41-0.033574))*1.039))))*Watts","v":0},{"$f":"ROUND(((H41/Watts)/((Tr_cool-Tv_cool)*1.163))*$I$14,IF($X$4=1,0,IF($X$4=2,2)))","v":0},{"$f":"($AA$42*(I41/$I$14)^$AA$44)*$J$14","v":{"$error":"#NUM!"}},{"$f":"L41-8","v":-8},{"$f":"AB41","v":0},0,{"$f":"AD41*Cubics","v":0},{"$f":"((($D41/Watts)/(((p_atm*0.028964)/(8.31447*(20+273.15)))*(($N41/3600)/Cubics)*(1005+1870*((0.622)/(((p_atm)/($E$12*Pvs_Heat_in))-1)))))+Tl_heat)*Celc1+Celc2","v":{"$error":"#DIV/0!"}},{"$f":"(Tl_cool-(($G41/Watts)/(1006*$N41*kgss)))*Celc1+Celc2","v":{"$error":"#DIV/0!"}},1,0,0,0,0.78069999999999995,0,{"$f":"(H41-G41)/H41","v":{"$error":"#DIV/0!"}},{"$f":"IF($X$16=1,AE41,IF($X$16=2,AL41,IF($X$16=3,BK41,IF($X$16=4,BD41,IF($X$16=5,BZ41,IF($X$16=6,BS41,IF($X$16=7,AW41,)))))))","v":0},0,0,0,0,0,0,null,null,null,null,null,null,null,null,null,null,null,null,null,null,null,null,null,null,null,null,null,null,null,null,null,1069.3056299999998,"a",257.52950118313976,"a",30,2.3839999999999999,84,1246.4550848435726,"a",268.22091495433523,"a",{"$f":"BH41","v":30},2.3839999999999999,84]
[null,0.4,4,{"$f":"(X42*($T$11^$Q42))*Watts*CF_Altit","v":0},{"$f":"ROUND(((D42/Watts)/(($S$9-$S$10)*1.163))*$E$14,IF($X$4=1,0,IF($X$4=2,2)))","v":0},{"$f":"($Y$42*(E42/$E$14)^$Y$44)*$F$14","v":{"$error":"#NUM!"}},{"$f":"(Z42*($W$11^R42))*Watts*CF_Altit","v":0},{"$f":"((G42/Watts)/(IF((237.3*LN((RH*EXP(17.27*(Tl_cool/(Tl_cool+237.3))))))/(17.27-LN((RH*EXP(17.27*(Tl_cool/(Tl_cool+237.3))))))<Tavg_cold,1,IF(1/(1+((2258*((0.622/(($Z$11/(1*611*EXP(17.27*(Tavg_cold/(Tavg_cold+237.3))))))-1)*1000-(0.622/(($Z$11/(RH*611*EXP(17.27*(Tl_cool/(Tl_cool+237.3))))))-1)*1000))/(1005*(Tavg_cold-Tl_cool))))*1.039+((-0.000729*$C42+0.001448)*(Tl_cool-Tavg_cold)+(0.016908*$C42-0.033574))*1.039>1,1,1/(1+((2258*((0.622/(($Z$11/(1*611*EXP(17.27*(Tavg_cold/(Tavg_cold+237.3))))))-1)*1000-(0.622/(($Z$11/(RH*611*EXP(17.27*(Tl_cool/(Tl_cool+237.3))))))-1)*1000))/(1005*(Tavg_cold-Tl_cool))))*1.039+((-0.000729*$C42+0.001448)*(Tl_cool-Tavg_cold)+(0.016908*$C42-0.033574))*1.039))))*Watts","v":0},{"$f":"ROUND(((H42/Watts)/((Tr_cool-Tv_cool)*1.163))*$I$14,IF($X$4=1,0,IF($X$4=2,2)))","v":0},{"$f":"($AA$42*(I42/$I$14)^$AA$44)*$J$14","v":{"$error":"#NUM!"}},{"$f":"L42-8","v":-8},0,0,{"$f":"AD42*Cubics","v":0},{"$f":"((($D42/Watts)/(((p_atm*0.028964)/(8.31447*(20+273.15)))*(($N42/3600)/Cubics)*(1005+1870*((0.622)/(((p_atm)/($E$12*Pvs_Heat_in))-1)))))+Tl_heat)*Celc1+Celc2","v":{"$error":"#DIV/0!"}},{"$f":"(Tl_cool-(($G42/Watts)/(1006*$N42*kgss)))*Celc1+Celc2","v":{"$error":"#DIV/0!"}},1,0,0,0,0.85870000000000002,0,{"$f":"(H42-G42)/H42","v":{"$error":"#DIV/0!"}},0,0,0,0,0,0,0,null,null,null,null,null,null,null,null,null,null,null,null,null,null,null,null,null,null,null,null,null,null,null,null,null,2132.5583699999997,6.8933500000000007E-5,467.68251622130913,1.6396787877446146E-5,35,4.032,158,2756.7487442450069,5.3973746074995627E-5,487.02188899452034,{"$f":"BL42","v":5.3973746074995627E-5},35,4.032,158]
[null,0.6,6,{"$f":"(X43*($T$11^$Q43))*Watts*CF_Altit","v":0},{"$f":"ROUND(((D43/Watts)/(($S$9-$S$10)*1.163))*$E$14,IF($X$4=1,0,IF($X$4=2,2)))","v":0},{"$f":"($Y$42*(E43/$E$14)^$Y$44)*$F$14","v":{"$error":"#NUM!"}},{"$f":"(Z43*($W$11^R43))*Watts*CF_Altit","v":0},{"$f":"((G43/Watts)/(IF((237.3*LN((RH*EXP(17.27*(Tl_cool/(Tl_cool+237.3))))))/(17.27-LN((RH*EXP(17.27*(Tl_cool/(Tl_cool+237.3))))))<Tavg_cold,1,IF(1/(1+((2258*((0.622/(($Z$11/(1*611*EXP(17.27*(Tavg_cold/(Tavg_cold+237.3))))))-1)*1000-(0.622/(($Z$11/(RH*611*EXP(17.27*(Tl_cool/(Tl_cool+237.3))))))-1)*1000))/(1005*(Tavg_cold-Tl_cool))))*1.039+((-0.000729*$C43+0.001448)*(Tl_cool-Tavg_cold)+(0.016908*$C43-0.033574))*1.039>1,1,1/(1+((2258*((0.622/(($Z$11/(1*611*EXP(17.27*(Tavg_cold/(Tavg_cold+237.3))))))-1)*1000-(0.622/(($Z$11/(RH*611*EXP(17.27*(Tl_cool/(Tl_cool+237.3))))))-1)*1000))/(1005*(Tavg_cold-Tl_cool))))*1.039+((-0.000729*$C43+0.001448)*(Tl_cool-Tavg_cold)+(0.016908*$C43-0.033574))*1.039))))*Watts","v":0},{"$f":"ROUND(((H43/Watts)/((Tr_cool-Tv_cool)*1.163))*$I$14,IF($X$4=1,0,IF($X$4=2,2)))","v":0},{"$f":"($AA$42*(I43/$I$14)^$AA$44)*$J$14","v":{"$error":"#NUM!"}},{"$f":"L43-8","v":-8},0,0,{"$f":"AD43*Cubics","v":0},{"$f":"((($D43/Watts)/(((p_atm*0.028964)/(8.31447*(20+273.15)))*(($N43/3600)/Cubics)*(1005+1870*((0.622)/(((p_atm)/($E$12*Pvs_Heat_in))-1)))))+Tl_heat)*Celc1+Celc2","v":{"$error":"#DIV/0!"}},{"$f":"(Tl_cool-(($G43/Watts)/(1006*$N43*kgss)))*Celc1+Celc2","v":{"$error":"#DIV/0!"}},1,0,0,0,0.8831,0,{"$f":"(H43-G43)/H43","v":{"$error":"#DIV/0!"}},{"$f":"IF($X$16=1,AE43,IF($X$16=2,AL43,IF($X$16=3,BK43,IF($X$16=4,BD43,IF($X$16=5,BZ43,IF($X$16=6,BS43,IF($X$16=7,AW43,)))))))","v":0},0,0,0,0,0,0,null,null,null,null,null,null,null,null,null,null,null,null,null,null,null,null,null,null,null,null,null,null,null,null,null,3007.9178699999998,"b",672.34485957619734,"b",40,7.4,259,4109.5520365369757,"b",695.53928386868654,"b",40,7.4,259]
[null,0.8,8,{"$f":"(X44*($T$11^$Q44))*Watts*CF_Altit","v":0},{"$f":"ROUND(((D44/Watts)/(($S$9-$S$10)*1.163))*$E$14,IF($X$4=1,0,IF($X$4=2,2)))","v":0},{"$f":"($Y$42*(E44/$E$14)^$Y$44)*$F$14","v":{"$error":"#NUM!"}},{"$f":"(Z44*($W$11^R44))*Watts*CF_Altit","v":0},{"$f":"((G44/Watts)/(IF((237.3*LN((RH*EXP(17.27*(Tl_cool/(Tl_cool+237.3))))))/(17.27-LN((RH*EXP(17.27*(Tl_cool/(Tl_cool+237.3))))))<Tavg_cold,1,IF(1/(1+((2258*((0.622/(($Z$11/(1*611*EXP(17.27*(Tavg_cold/(Tavg_cold+237.3))))))-1)*1000-(0.622/(($Z$11/(RH*611*EXP(17.27*(Tl_cool/(Tl_cool+237.3))))))-1)*1000))/(1005*(Tavg_cold-Tl_cool))))*1.039+((-0.000729*$C44+0.001448)*(Tl_cool-Tavg_cold)+(0.016908*$C44-0.033574))*1.039>1,1,1/(1+((2258*((0.622/(($Z$11/(1*611*EXP(17.27*(Tavg_cold/(Tavg_cold+237.3))))))-1)*1000-(0.622/(($Z$11/(RH*611*EXP(17.27*(Tl_cool/(Tl_cool+237.3))))))-1)*1000))/(1005*(Tavg_cold-Tl_cool))))*1.039+((-0.000729*$C44+0.001448)*(Tl_cool-Tavg_cold)+(0.016908*$C44-0.033574))*1.039))))*Watts","v":0},{"$f":"ROUND(((H44/Watts)/((Tr_cool-Tv_cool)*1.163))*$I$14,IF($X$4=1,0,IF($X$4=2,2)))","v":0},{"$f":"($AA$42*(I44/$I$14)^$AA$44)*$J$14","v":{"$error":"#NUM!"}},{"$f":"L44-8","v":-8},0,0,{"$f":"AD44*Cubics","v":0},{"$f":"((($D44/Watts)/(((p_atm*0.028964)/(8.31447*(20+273.15)))*(($N44/3600)/Cubics)*(1005+1870*((0.622)/(((p_atm)/($E$12*Pvs_Heat_in))-1)))))+Tl_heat)*Celc1+Celc2","v":{"$error":"#DIV/0!"}},{"$f":"(Tl_cool-(($G44/Watts)/(1006*$N44*kgss)))*Celc1+Celc2","v":{"$error":"#DIV/0!"}},1,0,0,0,0.85389999999999999,0,{"$f":"(H44-G44)/H44","v":{"$error":"#DIV/0!"}},0,0,0,0,0,0,0,null,null,null,null,null,null,null,null,null,null,null,null,null,null,null,null,null,null,null,null,null,null,null,null,null,3695.3841299999995,1.8570199999999999,871.51653124780432,1.9273120813486124,47,13.100000000000001,352,5304.8649617194806,1.8466258544050462,893.77309957683349,{"$f":"BL44","v":1.8466258544050462},47,13.100000000000001,352]
[null,1,10,{"$f":"(X45*($T$11^$Q45))*Watts*CF_Altit","v":0},{"$f":"ROUND(((D45/Watts)/(($S$9-$S$10)*1.163))*$E$14,IF($X$4=1,0,IF($X$4=2,2)))","v":0},{"$f":"($Y$42*(E45/$E$14)^$Y$44)*$F$14","v":{"$error":"#NUM!"}},{"$f":"(Z45*($W$11^R45))*Watts*CF_Altit","v":0},{"$f":"((G45/Watts)/(IF((237.3*LN((RH*EXP(17.27*(Tl_cool/(Tl_cool+237.3))))))/(17.27-LN((RH*EXP(17.27*(Tl_cool/(Tl_cool+237.3))))))<Tavg_cold,1,IF(1/(1+((2258*((0.622/(($Z$11/(1*611*EXP(17.27*(Tavg_cold/(Tavg_cold+237.3))))))-1)*1000-(0.622/(($Z$11/(RH*611*EXP(17.27*(Tl_cool/(Tl_cool+237.3))))))-1)*1000))/(1005*(Tavg_cold-Tl_cool))))*1.039+((-0.000729*$C45+0.001448)*(Tl_cool-Tavg_cold)+(0.016908*$C45-0.033574))*1.039>1,1,1/(1+((2258*((0.622/(($Z$11/(1*611*EXP(17.27*(Tavg_cold/(Tavg_cold+237.3))))))-1)*1000-(0.622/(($Z$11/(RH*611*EXP(17.27*(Tl_cool/(Tl_cool+237.3))))))-1)*1000))/(1005*(Tavg_cold-Tl_cool))))*1.039+((-0.000729*$C45+0.001448)*(Tl_cool-Tavg_cold)+(0.016908*$C45-0.033574))*1.039))))*Watts","v":0},{"$f":"ROUND(((H45/Watts)/((Tr_cool-Tv_cool)*1.163))*$I$14,IF($X$4=1,0,IF($X$4=2,2)))","v":0},{"$f":"($AA$42*(I45/$I$14)^$AA$44)*$J$14","v":{"$error":"#NUM!"}},{"$f":"L45-8","v":-8},0,0,{"$f":"AD45*Cubics","v":0},{"$f":"((($D45/Watts)/(((p_atm*0.028964)/(8.31447*(20+273.15)))*(($N45/3600)/Cubics)*(1005+1870*((0.622)/(((p_atm)/($E$12*Pvs_Heat_in))-1)))))+Tl_heat)*Celc1+Celc2","v":{"$error":"#DIV/0!"}},{"$f":"(Tl_cool-(($G45/Watts)/(1006*$N45*kgss)))*Celc1+Celc2","v":{"$error":"#DIV/0!"}},1,0,0,0,0.77110000000000001,0,{"$f":"(H45-G45)/H45","v":{"$error":"#DIV/0!"}},0,0,0,0,0,0,0,null,null,null,null,null,null,null,null,null,null,null,null,null,null,null,null,null,null,null,null,null,null,null,null,null,4194.9571499999984,null,1065.1975312361303,null,50,19.399999999999999,410,6342.6875197925201,null,1081.7233361189615,null,50,19.399999999999999,410]
[null,{"$f":"IF($S$7=1,NL!A45,IF(cal!$S$7=2,EN!A45,IF(cal!$S$7=3,DE!A45,IF(cal!$S$7=4,FR!A45,IF(cal!$S$7=5,NR!A45,IF(cal!$S$7=6,SP!A45,IF(cal!$S$7=7,SW!A45,IF(cal!$S$7=8,TS!A45,IF(cal!$S$7=9,ExtraTaal1!A45,IF(cal!$S$7=10,ExtraTaal2!A45,IF(cal!$S$7=11,ExtraTaal3!A45,)))))))))))","v":"Clima Canal altura 0 cm ancho 0 cm longitud 0 cm (Type 6)"},{"$f":"IF($S$7=1,NL!B45,IF(cal!$S$7=2,EN!B45,IF(cal!$S$7=3,DE!B45,IF(cal!$S$7=4,FR!B45,IF(cal!$S$7=5,NR!B45,IF(cal!$S$7=6,SP!B45,IF(cal!$S$7=7,SW!B45,IF(cal!$S$7=8,TS!B45,IF(cal!$S$7=9,ExtraTaal1!B45,IF(cal!$S$7=10,ExtraTaal2!B45,IF(cal!$S$7=11,ExtraTaal3!B45,)))))))))))","v":0},{"$f":"IF($S$7=1,NL!C45,IF(cal!$S$7=2,EN!C45,IF(cal!$S$7=3,DE!C45,IF(cal!$S$7=4,FR!C45,IF(cal!$S$7=5,NR!C45,IF(cal!$S$7=6,SP!C45,IF(cal!$S$7=7,SW!C45,IF(cal!$S$7=8,TS!C45,IF(cal!$S$7=9,ExtraTaal1!C45,IF(cal!$S$7=10,ExtraTaal2!C45,IF(cal!$S$7=11,ExtraTaal3!C45,)))))))))))","v":0},{"$f":"IF($S$7=1,NL!D45,IF(cal!$S$7=2,EN!D45,IF(cal!$S$7=3,DE!D45,IF(cal!$S$7=4,FR!D45,IF(cal!$S$7=5,NR!D45,IF(cal!$S$7=6,SP!D45,IF(cal!$S$7=7,SW!D45,IF(cal!$S$7=8,TS!D45,IF(cal!$S$7=9,ExtraTaal1!D45,IF(cal!$S$7=10,ExtraTaal2!D45,IF(cal!$S$7=11,ExtraTaal3!D45,)))))))))))","v":0},{"$f":"IF($S$7=1,NL!E45,IF(cal!$S$7=2,EN!E45,IF(cal!$S$7=3,DE!E45,IF(cal!$S$7=4,FR!E45,IF(cal!$S$7=5,NR!E45,IF(cal!$S$7=6,SP!E45,IF(cal!$S$7=7,SW!E45,IF(cal!$S$7=8,TS!E45,IF(cal!$S$7=9,ExtraTaal1!E45,IF(cal!$S$7=10,ExtraTaal2!E45,IF(cal!$S$7=11,ExtraTaal3!E45,)))))))))))","v":0},{"$f":"IF($S$7=1,NL!F45,IF(cal!$S$7=2,EN!F45,IF(cal!$S$7=3,DE!F45,IF(cal!$S$7=4,FR!F45,IF(cal!$S$7=5,NR!F45,IF(cal!$S$7=6,SP!F45,IF(cal!$S$7=7,SW!F45,IF(cal!$S$7=8,TS!F45,IF(cal!$S$7=9,ExtraTaal1!F45,IF(cal!$S$7=10,ExtraTaal2!F45,IF(cal!$S$7=11,ExtraTaal3!F45,)))))))))))","v":0},{"$f":"IF($S$7=1,NL!G45,IF(cal!$S$7=2,EN!G45,IF(cal!$S$7=3,DE!G45,IF(cal!$S$7=4,FR!G45,IF(cal!$S$7=5,NR!G45,IF(cal!$S$7=6,SP!G45,IF(cal!$S$7=7,SW!G45,IF(cal!$S$7=8,TS!G45,IF(cal!$S$7=9,ExtraTaal1!G45,IF(cal!$S$7=10,ExtraTaal2!G45,IF(cal!$S$7=11,ExtraTaal3!G45,)))))))))))","v":0},{"$f":"IF($S$7=1,NL!H45,IF(cal!$S$7=2,EN!H45,IF(cal!$S$7=3,DE!H45,IF(cal!$S$7=4,FR!H45,IF(cal!$S$7=5,NR!H45,IF(cal!$S$7=6,SP!H45,IF(cal!$S$7=7,SW!H45,IF(cal!$S$7=8,TS!H45,IF(cal!$S$7=9,ExtraTaal1!H45,IF(cal!$S$7=10,ExtraTaal2!H45,IF(cal!$S$7=11,ExtraTaal3!H45,)))))))))))","v":0},{"$f":"IF($S$7=1,NL!I45,IF(cal!$S$7=2,EN!I45,IF(cal!$S$7=3,DE!I45,IF(cal!$S$7=4,FR!I45,IF(cal!$S$7=5,NR!I45,IF(cal!$S$7=6,SP!I45,IF(cal!$S$7=7,SW!I45,IF(cal!$S$7=8,TS!I45,IF(cal!$S$7=9,ExtraTaal1!I45,IF(cal!$S$7=10,ExtraTaal2!I45,IF(cal!$S$7=11,ExtraTaal3!I45,)))))))))))","v":0},{"$f":"IF($S$7=1,NL!J45,IF(cal!$S$7=2,EN!J45,IF(cal!$S$7=3,DE!J45,IF(cal!$S$7=4,FR!J45,IF(cal!$S$7=5,NR!J45,IF(cal!$S$7=6,SP!J45,IF(cal!$S$7=7,SW!J45,IF(cal!$S$7=8,TS!J45,IF(cal!$S$7=9,ExtraTaal1!J45,IF(cal!$S$7=10,ExtraTaal2!J45,IF(cal!$S$7=11,ExtraTaal3!J45,)))))))))))","v":0},{"$f":"IF($S$7=1,NL!K45,IF(cal!$S$7=2,EN!K45,IF(cal!$S$7=3,DE!K45,IF(cal!$S$7=4,FR!K45,IF(cal!$S$7=5,NR!K45,IF(cal!$S$7=6,SP!K45,IF(cal!$S$7=7,SW!K45,IF(cal!$S$7=8,TS!K45,IF(cal!$S$7=9,ExtraTaal1!K45,IF(cal!$S$7=10,ExtraTaal2!K45,IF(cal!$S$7=11,ExtraTaal3!K45,)))))))))))","v":0},{"$f":"IF($S$7=1,NL!L45,IF(cal!$S$7=2,EN!L45,IF(cal!$S$7=3,DE!L45,IF(cal!$S$7=4,FR!L45,IF(cal!$S$7=5,NR!L45,IF(cal!$S$7=6,SP!L45,IF(cal!$S$7=7,SW!L45,IF(cal!$S$7=8,TS!L45,IF(cal!$S$7=9,ExtraTaal1!L45,IF(cal!$S$7=10,ExtraTaal2!L45,IF(cal!$S$7=11,ExtraTaal3!L45,)))))))))))","v":0},{"$f":"IF($S$7=1,NL!M45,IF(cal!$S$7=2,EN!M45,IF(cal!$S$7=3,DE!M45,IF(cal!$S$7=4,FR!M45,IF(cal!$S$7=5,NR!M45,IF(cal!$S$7=6,SP!M45,IF(cal!$S$7=7,SW!M45,IF(cal!$S$7=8,TS!M45,IF(cal!$S$7=9,ExtraTaal1!M45,IF(cal!$S$7=10,ExtraTaal2!M45,IF(cal!$S$7=11,ExtraTaal3!M45,)))))))))))","v":0},{"$f":"IF($S$7=1,NL!N45,IF(cal!$S$7=2,EN!N45,IF(cal!$S$7=3,DE!N45,IF(cal!$S$7=4,FR!N45,IF(cal!$S$7=5,NR!N45,IF(cal!$S$7=6,SP!N45,IF(cal!$S$7=7,SW!N45,IF(cal!$S$7=8,TS!N45,IF(cal!$S$7=9,ExtraTaal1!N45,IF(cal!$S$7=10,ExtraTaal2!N45,IF(cal!$S$7=11,ExtraTaal3!N45,)))))))))))","v":0},{"$f":"IF($S$7=1,NL!O45,IF(cal!$S$7=2,EN!O45,IF(cal!$S$7=3,DE!O45,IF(cal!$S$7=4,FR!O45,IF(cal!$S$7=5,NR!O45,IF(cal!$S$7=6,SP!O45,IF(cal!$S$7=7,SW!O45,IF(cal!$S$7=8,TS!O45,IF(cal!$S$7=9,ExtraTaal1!O45,IF(cal!$S$7=10,ExtraTaal2!O45,IF(cal!$S$7=11,ExtraTaal3!O45,)))))))))))","v":0},"n-value","n-value","n-value","n-value","n-value","n-value",null,0,0,0,0,0,0,0,null,null,null,null,null,null,null,null,null,null,null,null,null,null,null,null,null,null,null,null,null,null,null,null,null,"H",{"$f":"BE22","v":13},"B",{"$f":"BG22","v":32},"L",{"$f":"IF($X$4=1,170,170/2.54)","v":170},null,"H",{"$f":"BL22","v":13},"B",{"$f":"BN22","v":32},"L",{"$f":"IF($X$4=1,170,170/2.54)","v":170}]
[null,0.2,2,{"$f":"(X47*($T$11^$Q47))*Watts*CF_Altit","v":0},{"$f":"ROUND(((D47/Watts)/(($S$9-$S$10)*1.163))*$E$14,IF($X$4=1,0,IF($X$4=2,2)))","v":0},{"$f":"($Y$48*(E47/$E$14)^$Y$50)*$F$14","v":{"$error":"#NUM!"}},{"$f":"(Z47*($W$11^R47))*Watts*CF_Altit","v":0},{"$f":"((G47/Watts)/(IF((237.3*LN((RH*EXP(17.27*(Tl_cool/(Tl_cool+237.3))))))/(17.27-LN((RH*EXP(17.27*(Tl_cool/(Tl_cool+237.3))))))<Tavg_cold,1,IF(1/(1+((2258*((0.622/(($Z$11/(1*611*EXP(17.27*(Tavg_cold/(Tavg_cold+237.3))))))-1)*1000-(0.622/(($Z$11/(RH*611*EXP(17.27*(Tl_cool/(Tl_cool+237.3))))))-1)*1000))/(1005*(Tavg_cold-Tl_cool))))*1.039+((-0.000729*$C47+0.001448)*(Tl_cool-Tavg_cold)+(0.016908*$C47-0.033574))*1.039>1,1,1/(1+((2258*((0.622/(($Z$11/(1*611*EXP(17.27*(Tavg_cold/(Tavg_cold+237.3))))))-1)*1000-(0.622/(($Z$11/(RH*611*EXP(17.27*(Tl_cool/(Tl_cool+237.3))))))-1)*1000))/(1005*(Tavg_cold-Tl_cool))))*1.039+((-0.000729*$C47+0.001448)*(Tl_cool-Tavg_cold)+(0.016908*$C47-0.033574))*1.039))))*Watts","v":0},{"$f":"ROUND(((H47/Watts)/((Tr_cool-Tv_cool)*1.163))*$I$14,IF($X$4=1,0,IF($X$4=2,2)))","v":0},{"$f":"($AA$48*(I47/$I$14)^$AA$50)*$J$14","v":{"$error":"#NUM!"}},{"$f":"L47-8","v":-8},{"$f":"AB47","v":0},0,{"$f":"AD47*Cubics","v":0},{"$f":"((($D47/Watts)/(((p_atm*0.028964)/(8.31447*(20+273.15)))*(($N47/3600)/Cubics)*(1005+1870*((0.622)/(((p_atm)/($E$12*Pvs_Heat_in))-1)))))+Tl_heat)*Celc1+Celc2","v":{"$error":"#DIV/0!"}},{"$f":"(Tl_cool-(($G47/Watts)/(1006*$N47*kgss)))*Celc1+Celc2","v":{"$error":"#DIV/0!"}},1,0,0,0,0.78069999999999995,0,{"$f":"(H47-G47)/H47","v":{"$error":"#DIV/0!"}},{"$f":"IF($X$16=1,AE47,IF($X$16=2,AL47,IF($X$16=3,BK47,IF($X$16=4,BD47,IF($X$16=5,BZ47,IF($X$16=6,BS47,IF($X$16=7,AW47,)))))))","v":0},0,0,0,0,0,0,null,null,null,null,null,null,null,null,null,null,null,null,null,null,null,null,null,null,null,null,null,null,null,null,null,1309.5990299999999,"a",315.40129920182284,"a",31,2.4079999999999999,93,1526.5573511005555,"a",328.49527786542183,"a",{"$f":"BH47","v":31},2.4079999999999999,93]
[null,0.4,4,{"$f":"(X48*($T$11^$Q48))*Watts*CF_Altit","v":0},{"$f":"ROUND(((D48/Watts)/(($S$9-$S$10)*1.163))*$E$14,IF($X$4=1,0,IF($X$4=2,2)))","v":0},{"$f":"($Y$48*(E48/$E$14)^$Y$50)*$F$14","v":{"$error":"#NUM!"}},{"$f":"(Z48*($W$11^R48))*Watts*CF_Altit","v":0},{"$f":"((G48/Watts)/(IF((237.3*LN((RH*EXP(17.27*(Tl_cool/(Tl_cool+237.3))))))/(17.27-LN((RH*EXP(17.27*(Tl_cool/(Tl_cool+237.3))))))<Tavg_cold,1,IF(1/(1+((2258*((0.622/(($Z$11/(1*611*EXP(17.27*(Tavg_cold/(Tavg_cold+237.3))))))-1)*1000-(0.622/(($Z$11/(RH*611*EXP(17.27*(Tl_cool/(Tl_cool+237.3))))))-1)*1000))/(1005*(Tavg_cold-Tl_cool))))*1.039+((-0.000729*$C48+0.001448)*(Tl_cool-Tavg_cold)+(0.016908*$C48-0.033574))*1.039>1,1,1/(1+((2258*((0.622/(($Z$11/(1*611*EXP(17.27*(Tavg_cold/(Tavg_cold+237.3))))))-1)*1000-(0.622/(($Z$11/(RH*611*EXP(17.27*(Tl_cool/(Tl_cool+237.3))))))-1)*1000))/(1005*(Tavg_cold-Tl_cool))))*1.039+((-0.000729*$C48+0.001448)*(Tl_cool-Tavg_cold)+(0.016908*$C48-0.033574))*1.039))))*Watts","v":0},{"$f":"ROUND(((H48/Watts)/((Tr_cool-Tv_cool)*1.163))*$I$14,IF($X$4=1,0,IF($X$4=2,2)))","v":0},{"$f":"($AA$48*(I48/$I$14)^$AA$50)*$J$14","v":{"$error":"#NUM!"}},{"$f":"L48-8","v":-8},0,0,{"$f":"AD48*Cubics","v":0},{"$f":"((($D48/Watts)/(((p_atm*0.028964)/(8.31447*(20+273.15)))*(($N48/3600)/Cubics)*(1005+1870*((0.622)/(((p_atm)/($E$12*Pvs_Heat_in))-1)))))+Tl_heat)*Celc1+Celc2","v":{"$error":"#DIV/0!"}},{"$f":"(Tl_cool-(($G48/Watts)/(1006*$N48*kgss)))*Celc1+Celc2","v":{"$error":"#DIV/0!"}},1,0,0,0,0.85870000000000002,0,{"$f":"(H48-G48)/H48","v":{"$error":"#DIV/0!"}},0,0,0,0,0,0,0,null,null,null,null,null,null,null,null,null,null,null,null,null,null,null,null,null,null,null,null,null,null,null,null,null,2611.7849699999997,{"$f":" 0.0000825244","v":8.2524399999999999E-5},572.77971087778303,1.7821330446923193E-5,36.5,4.2,199,3376.2428440753456,6.5019104543708104E-5,596.46501011688451,{"$f":"BL48","v":6.5019104543708104E-5},36.5,4.2,199]
[null,0.6,6,{"$f":"(X49*($T$11^$Q49))*Watts*CF_Altit","v":0},{"$f":"ROUND(((D49/Watts)/(($S$9-$S$10)*1.163))*$E$14,IF($X$4=1,0,IF($X$4=2,2)))","v":0},{"$f":"($Y$48*(E49/$E$14)^$Y$50)*$F$14","v":{"$error":"#NUM!"}},{"$f":"(Z49*($W$11^R49))*Watts*CF_Altit","v":0},{"$f":"((G49/Watts)/(IF((237.3*LN((RH*EXP(17.27*(Tl_cool/(Tl_cool+237.3))))))/(17.27-LN((RH*EXP(17.27*(Tl_cool/(Tl_cool+237.3))))))<Tavg_cold,1,IF(1/(1+((2258*((0.622/(($Z$11/(1*611*EXP(17.27*(Tavg_cold/(Tavg_cold+237.3))))))-1)*1000-(0.622/(($Z$11/(RH*611*EXP(17.27*(Tl_cool/(Tl_cool+237.3))))))-1)*1000))/(1005*(Tavg_cold-Tl_cool))))*1.039+((-0.000729*$C49+0.001448)*(Tl_cool-Tavg_cold)+(0.016908*$C49-0.033574))*1.039>1,1,1/(1+((2258*((0.622/(($Z$11/(1*611*EXP(17.27*(Tavg_cold/(Tavg_cold+237.3))))))-1)*1000-(0.622/(($Z$11/(RH*611*EXP(17.27*(Tl_cool/(Tl_cool+237.3))))))-1)*1000))/(1005*(Tavg_cold-Tl_cool))))*1.039+((-0.000729*$C49+0.001448)*(Tl_cool-Tavg_cold)+(0.016908*$C49-0.033574))*1.039))))*Watts","v":0},{"$f":"ROUND(((H49/Watts)/((Tr_cool-Tv_cool)*1.163))*$I$14,IF($X$4=1,0,IF($X$4=2,2)))","v":0},{"$f":"($AA$48*(I49/$I$14)^$AA$50)*$J$14","v":{"$error":"#NUM!"}},{"$f":"L49-8","v":-8},0,0,{"$f":"AD49*Cubics","v":0},{"$f":"((($D49/Watts)/(((p_atm*0.028964)/(8.31447*(20+273.15)))*(($N49/3600)/Cubics)*(1005+1870*((0.622)/(((p_atm)/($E$12*Pvs_Heat_in))-1)))))+Tl_heat)*Celc1+Celc2","v":{"$error":"#DIV/0!"}},{"$f":"(Tl_cool-(($G49/Watts)/(1006*$N49*kgss)))*Celc1+Celc2","v":{"$error":"#DIV/0!"}},1,0,0,0,0.8831,0,{"$f":"(H49-G49)/H49","v":{"$error":"#DIV/0!"}},{"$f":"IF($X$16=1,AE49,IF($X$16=2,AL49,IF($X$16=3,BK49,IF($X$16=4,BD49,IF($X$16=5,BZ49,IF($X$16=6,BS49,IF($X$16=7,AW49,)))))))","v":0},0,0,0,0,0,0,null,null,null,null,null,null,null,null,null,null,null,null,null,null,null,null,null,null,null,null,null,null,null,null,null,3683.8544699999998,"b",823.43359206523041,"b",40.5,7.4,307,5033.0468762082064,"b",851.84024653580707,"b",40.5,7.4,307]
[null,0.8,8,{"$f":"(X50*($T$11^$Q50))*Watts*CF_Altit","v":0},{"$f":"ROUND(((D50/Watts)/(($S$9-$S$10)*1.163))*$E$14,IF($X$4=1,0,IF($X$4=2,2)))","v":0},{"$f":"($Y$48*(E50/$E$14)^$Y$50)*$F$14","v":{"$error":"#NUM!"}},{"$f":"(Z50*($W$11^R50))*Watts*CF_Altit","v":0},{"$f":"((G50/Watts)/(IF((237.3*LN((RH*EXP(17.27*(Tl_cool/(Tl_cool+237.3))))))/(17.27-LN((RH*EXP(17.27*(Tl_cool/(Tl_cool+237.3))))))<Tavg_cold,1,IF(1/(1+((2258*((0.622/(($Z$11/(1*611*EXP(17.27*(Tavg_cold/(Tavg_cold+237.3))))))-1)*1000-(0.622/(($Z$11/(RH*611*EXP(17.27*(Tl_cool/(Tl_cool+237.3))))))-1)*1000))/(1005*(Tavg_cold-Tl_cool))))*1.039+((-0.000729*$C50+0.001448)*(Tl_cool-Tavg_cold)+(0.016908*$C50-0.033574))*1.039>1,1,1/(1+((2258*((0.622/(($Z$11/(1*611*EXP(17.27*(Tavg_cold/(Tavg_cold+237.3))))))-1)*1000-(0.622/(($Z$11/(RH*611*EXP(17.27*(Tl_cool/(Tl_cool+237.3))))))-1)*1000))/(1005*(Tavg_cold-Tl_cool))))*1.039+((-0.000729*$C50+0.001448)*(Tl_cool-Tavg_cold)+(0.016908*$C50-0.033574))*1.039))))*Watts","v":0},{"$f":"ROUND(((H50/Watts)/((Tr_cool-Tv_cool)*1.163))*$I$14,IF($X$4=1,0,IF($X$4=2,2)))","v":0},{"$f":"($AA$48*(I50/$I$14)^$AA$50)*$J$14","v":{"$error":"#NUM!"}},{"$f":"L50-8","v":-8},0,0,{"$f":"AD50*Cubics","v":0},{"$f":"((($D50/Watts)/(((p_atm*0.028964)/(8.31447*(20+273.15)))*(($N50/3600)/Cubics)*(1005+1870*((0.622)/(((p_atm)/($E$12*Pvs_Heat_in))-1)))))+Tl_heat)*Celc1+Celc2","v":{"$error":"#DIV/0!"}},{"$f":"(Tl_cool-(($G50/Watts)/(1006*$N50*kgss)))*Celc1+Celc2","v":{"$error":"#DIV/0!"}},1,0,0,0,0.85389999999999999,0,{"$f":"(H50-G50)/H50","v":{"$error":"#DIV/0!"}},0,0,0,0,0,0,0,null,null,null,null,null,null,null,null,null,null,null,null,null,null,null,null,null,null,null,null,null,null,null,null,null,4525.8075299999991,1.84541,1067.3629427641649,1.9208636901745513,47.5,13.600000000000001,403,6496.9694474991384,1.8351115788823005,1094.6209871221893,{"$f":"BL50","v":1.8351115788823005},47.5,13.600000000000001,403]
[null,1,10,{"$f":"(X51*($T$11^$Q51))*Watts*CF_Altit","v":0},{"$f":"ROUND(((D51/Watts)/(($S$9-$S$10)*1.163))*$E$14,IF($X$4=1,0,IF($X$4=2,2)))","v":0},{"$f":"($Y$48*(E51/$E$14)^$Y$50)*$F$14","v":{"$error":"#NUM!"}},{"$f":"(Z51*($W$11^R51))*Watts*CF_Altit","v":0},{"$f":"((G51/Watts)/(IF((237.3*LN((RH*EXP(17.27*(Tl_cool/(Tl_cool+237.3))))))/(17.27-LN((RH*EXP(17.27*(Tl_cool/(Tl_cool+237.3))))))<Tavg_cold,1,IF(1/(1+((2258*((0.622/(($Z$11/(1*611*EXP(17.27*(Tavg_cold/(Tavg_cold+237.3))))))-1)*1000-(0.622/(($Z$11/(RH*611*EXP(17.27*(Tl_cool/(Tl_cool+237.3))))))-1)*1000))/(1005*(Tavg_cold-Tl_cool))))*1.039+((-0.000729*$C51+0.001448)*(Tl_cool-Tavg_cold)+(0.016908*$C51-0.033574))*1.039>1,1,1/(1+((2258*((0.622/(($Z$11/(1*611*EXP(17.27*(Tavg_cold/(Tavg_cold+237.3))))))-1)*1000-(0.622/(($Z$11/(RH*611*EXP(17.27*(Tl_cool/(Tl_cool+237.3))))))-1)*1000))/(1005*(Tavg_cold-Tl_cool))))*1.039+((-0.000729*$C51+0.001448)*(Tl_cool-Tavg_cold)+(0.016908*$C51-0.033574))*1.039))))*Watts","v":0},{"$f":"ROUND(((H51/Watts)/((Tr_cool-Tv_cool)*1.163))*$I$14,IF($X$4=1,0,IF($X$4=2,2)))","v":0},{"$f":"($AA$48*(I51/$I$14)^$AA$50)*$J$14","v":{"$error":"#NUM!"}},{"$f":"L51-8","v":-8},0,0,{"$f":"AD51*Cubics","v":0},{"$f":"((($D51/Watts)/(((p_atm*0.028964)/(8.31447*(20+273.15)))*(($N51/3600)/Cubics)*(1005+1870*((0.622)/(((p_atm)/($E$12*Pvs_Heat_in))-1)))))+Tl_heat)*Celc1+Celc2","v":{"$error":"#DIV/0!"}},{"$f":"(Tl_cool-(($G51/Watts)/(1006*$N51*kgss)))*Celc1+Celc2","v":{"$error":"#DIV/0!"}},1,0,0,0,0.77110000000000001,0,{"$f":"(H51-G51)/H51","v":{"$error":"#DIV/0!"}},0,0,0,0,0,0,0,null,null,null,null,null,null,null,null,null,null,null,null,null,null,null,null,null,null,null,null,null,null,null,null,null,5137.6441499999983,null,1304.5677629745867,null,50.5,20.9,475,7768.0105579481424,null,1324.8072318760314,null,50.5,20.9,475]
[null,{"$f":"IF($S$7=1,NL!A51,IF(cal!$S$7=2,EN!A51,IF(cal!$S$7=3,DE!A51,IF(cal!$S$7=4,FR!A51,IF(cal!$S$7=5,NR!A51,IF(cal!$S$7=6,SP!A51,IF(cal!$S$7=7,SW!A51,IF(cal!$S$7=8,TS!A51,IF(cal!$S$7=9,ExtraTaal1!A51,IF(cal!$S$7=10,ExtraTaal2!A51,IF(cal!$S$7=11,ExtraTaal3!A51,)))))))))))","v":"Clima Canal altura 0 cm ancho 0 cm longitud 0 cm (Type 7)"},{"$f":"IF($S$7=1,NL!B51,IF(cal!$S$7=2,EN!B51,IF(cal!$S$7=3,DE!B51,IF(cal!$S$7=4,FR!B51,IF(cal!$S$7=5,NR!B51,IF(cal!$S$7=6,SP!B51,IF(cal!$S$7=7,SW!B51,IF(cal!$S$7=8,TS!B51,IF(cal!$S$7=9,ExtraTaal1!B51,IF(cal!$S$7=10,ExtraTaal2!B51,IF(cal!$S$7=11,ExtraTaal3!B51,)))))))))))","v":0},{"$f":"IF($S$7=1,NL!C51,IF(cal!$S$7=2,EN!C51,IF(cal!$S$7=3,DE!C51,IF(cal!$S$7=4,FR!C51,IF(cal!$S$7=5,NR!C51,IF(cal!$S$7=6,SP!C51,IF(cal!$S$7=7,SW!C51,IF(cal!$S$7=8,TS!C51,IF(cal!$S$7=9,ExtraTaal1!C51,IF(cal!$S$7=10,ExtraTaal2!C51,IF(cal!$S$7=11,ExtraTaal3!C51,)))))))))))","v":0},{"$f":"IF($S$7=1,NL!D51,IF(cal!$S$7=2,EN!D51,IF(cal!$S$7=3,DE!D51,IF(cal!$S$7=4,FR!D51,IF(cal!$S$7=5,NR!D51,IF(cal!$S$7=6,SP!D51,IF(cal!$S$7=7,SW!D51,IF(cal!$S$7=8,TS!D51,IF(cal!$S$7=9,ExtraTaal1!D51,IF(cal!$S$7=10,ExtraTaal2!D51,IF(cal!$S$7=11,ExtraTaal3!D51,)))))))))))","v":0},{"$f":"IF($S$7=1,NL!E51,IF(cal!$S$7=2,EN!E51,IF(cal!$S$7=3,DE!E51,IF(cal!$S$7=4,FR!E51,IF(cal!$S$7=5,NR!E51,IF(cal!$S$7=6,SP!E51,IF(cal!$S$7=7,SW!E51,IF(cal!$S$7=8,TS!E51,IF(cal!$S$7=9,ExtraTaal1!E51,IF(cal!$S$7=10,ExtraTaal2!E51,IF(cal!$S$7=11,ExtraTaal3!E51,)))))))))))","v":0},{"$f":"IF($S$7=1,NL!F51,IF(cal!$S$7=2,EN!F51,IF(cal!$S$7=3,DE!F51,IF(cal!$S$7=4,FR!F51,IF(cal!$S$7=5,NR!F51,IF(cal!$S$7=6,SP!F51,IF(cal!$S$7=7,SW!F51,IF(cal!$S$7=8,TS!F51,IF(cal!$S$7=9,ExtraTaal1!F51,IF(cal!$S$7=10,ExtraTaal2!F51,IF(cal!$S$7=11,ExtraTaal3!F51,)))))))))))","v":0},{"$f":"IF($S$7=1,NL!G51,IF(cal!$S$7=2,EN!G51,IF(cal!$S$7=3,DE!G51,IF(cal!$S$7=4,FR!G51,IF(cal!$S$7=5,NR!G51,IF(cal!$S$7=6,SP!G51,IF(cal!$S$7=7,SW!G51,IF(cal!$S$7=8,TS!G51,IF(cal!$S$7=9,ExtraTaal1!G51,IF(cal!$S$7=10,ExtraTaal2!G51,IF(cal!$S$7=11,ExtraTaal3!G51,)))))))))))","v":0},{"$f":"IF($S$7=1,NL!H51,IF(cal!$S$7=2,EN!H51,IF(cal!$S$7=3,DE!H51,IF(cal!$S$7=4,FR!H51,IF(cal!$S$7=5,NR!H51,IF(cal!$S$7=6,SP!H51,IF(cal!$S$7=7,SW!H51,IF(cal!$S$7=8,TS!H51,IF(cal!$S$7=9,ExtraTaal1!H51,IF(cal!$S$7=10,ExtraTaal2!H51,IF(cal!$S$7=11,ExtraTaal3!H51,)))))))))))","v":0},{"$f":"IF($S$7=1,NL!I51,IF(cal!$S$7=2,EN!I51,IF(cal!$S$7=3,DE!I51,IF(cal!$S$7=4,FR!I51,IF(cal!$S$7=5,NR!I51,IF(cal!$S$7=6,SP!I51,IF(cal!$S$7=7,SW!I51,IF(cal!$S$7=8,TS!I51,IF(cal!$S$7=9,ExtraTaal1!I51,IF(cal!$S$7=10,ExtraTaal2!I51,IF(cal!$S$7=11,ExtraTaal3!I51,)))))))))))","v":0},{"$f":"IF($S$7=1,NL!J51,IF(cal!$S$7=2,EN!J51,IF(cal!$S$7=3,DE!J51,IF(cal!$S$7=4,FR!J51,IF(cal!$S$7=5,NR!J51,IF(cal!$S$7=6,SP!J51,IF(cal!$S$7=7,SW!J51,IF(cal!$S$7=8,TS!J51,IF(cal!$S$7=9,ExtraTaal1!J51,IF(cal!$S$7=10,ExtraTaal2!J51,IF(cal!$S$7=11,ExtraTaal3!J51,)))))))))))","v":0},{"$f":"IF($S$7=1,NL!K51,IF(cal!$S$7=2,EN!K51,IF(cal!$S$7=3,DE!K51,IF(cal!$S$7=4,FR!K51,IF(cal!$S$7=5,NR!K51,IF(cal!$S$7=6,SP!K51,IF(cal!$S$7=7,SW!K51,IF(cal!$S$7=8,TS!K51,IF(cal!$S$7=9,ExtraTaal1!K51,IF(cal!$S$7=10,ExtraTaal2!K51,IF(cal!$S$7=11,ExtraTaal3!K51,)))))))))))","v":0},{"$f":"IF($S$7=1,NL!L51,IF(cal!$S$7=2,EN!L51,IF(cal!$S$7=3,DE!L51,IF(cal!$S$7=4,FR!L51,IF(cal!$S$7=5,NR!L51,IF(cal!$S$7=6,SP!L51,IF(cal!$S$7=7,SW!L51,IF(cal!$S$7=8,TS!L51,IF(cal!$S$7=9,ExtraTaal1!L51,IF(cal!$S$7=10,ExtraTaal2!L51,IF(cal!$S$7=11,ExtraTaal3!L51,)))))))))))","v":0},{"$f":"IF($S$7=1,NL!M51,IF(cal!$S$7=2,EN!M51,IF(cal!$S$7=3,DE!M51,IF(cal!$S$7=4,FR!M51,IF(cal!$S$7=5,NR!M51,IF(cal!$S$7=6,SP!M51,IF(cal!$S$7=7,SW!M51,IF(cal!$S$7=8,TS!M51,IF(cal!$S$7=9,ExtraTaal1!M51,IF(cal!$S$7=10,ExtraTaal2!M51,IF(cal!$S$7=11,ExtraTaal3!M51,)))))))))))","v":0},{"$f":"IF($S$7=1,NL!N51,IF(cal!$S$7=2,EN!N51,IF(cal!$S$7=3,DE!N51,IF(cal!$S$7=4,FR!N51,IF(cal!$S$7=5,NR!N51,IF(cal!$S$7=6,SP!N51,IF(cal!$S$7=7,SW!N51,IF(cal!$S$7=8,TS!N51,IF(cal!$S$7=9,ExtraTaal1!N51,IF(cal!$S$7=10,ExtraTaal2!N51,IF(cal!$S$7=11,ExtraTaal3!N51,)))))))))))","v":0},{"$f":"IF($S$7=1,NL!O51,IF(cal!$S$7=2,EN!O51,IF(cal!$S$7=3,DE!O51,IF(cal!$S$7=4,FR!O51,IF(cal!$S$7=5,NR!O51,IF(cal!$S$7=6,SP!O51,IF(cal!$S$7=7,SW!O51,IF(cal!$S$7=8,TS!O51,IF(cal!$S$7=9,ExtraTaal1!O51,IF(cal!$S$7=10,ExtraTaal2!O51,IF(cal!$S$7=11,ExtraTaal3!O51,)))))))))))","v":0},"n-value","n-value","n-value","n-value","n-value","n-value",null,0,0,0,0,0,0,0,null,null,null,null,null,null,null,null,null,null,null,null,null,null,null,null,null,null,null,null,null,null,null,null,null,"H",{"$f":"BE22","v":13},"B",{"$f":"BG22","v":32},"L",{"$f":"IF($X$4=1,200,200/2.54)","v":200},null,"H",{"$f":"BL22","v":13},"B",{"$f":"BN22","v":32},"L",{"$f":"IF($X$4=1,200,200/2.54)","v":200}]
[null,0.2,2,{"$f":"(X53*($T$11^$Q53))*Watts*CF_Altit","v":0},{"$f":"ROUND(((D53/Watts)/(($S$9-$S$10)*1.163))*$E$14,IF($X$4=1,0,IF($X$4=2,2)))","v":0},{"$f":"($Y$54*(E53/$E$14)^$Y$56)*$F$14","v":{"$error":"#NUM!"}},{"$f":"(Z53*($W$11^R53))*Watts*CF_Altit","v":0},{"$f":"((G53/Watts)/(IF((237.3*LN((RH*EXP(17.27*(Tl_cool/(Tl_cool+237.3))))))/(17.27-LN((RH*EXP(17.27*(Tl_cool/(Tl_cool+237.3))))))<Tavg_cold,1,IF(1/(1+((2258*((0.622/(($Z$11/(1*611*EXP(17.27*(Tavg_cold/(Tavg_cold+237.3))))))-1)*1000-(0.622/(($Z$11/(RH*611*EXP(17.27*(Tl_cool/(Tl_cool+237.3))))))-1)*1000))/(1005*(Tavg_cold-Tl_cool))))*1.039+((-0.000729*$C53+0.001448)*(Tl_cool-Tavg_cold)+(0.016908*$C53-0.033574))*1.039>1,1,1/(1+((2258*((0.622/(($Z$11/(1*611*EXP(17.27*(Tavg_cold/(Tavg_cold+237.3))))))-1)*1000-(0.622/(($Z$11/(RH*611*EXP(17.27*(Tl_cool/(Tl_cool+237.3))))))-1)*1000))/(1005*(Tavg_cold-Tl_cool))))*1.039+((-0.000729*$C53+0.001448)*(Tl_cool-Tavg_cold)+(0.016908*$C53-0.033574))*1.039))))*Watts","v":0},{"$f":"ROUND(((H53/Watts)/((Tr_cool-Tv_cool)*1.163))*$I$14,IF($X$4=1,0,IF($X$4=2,2)))","v":0},{"$f":"($AA$54*(I53/$I$14)^$AA$56)*$J$14","v":{"$error":"#NUM!"}},{"$f":"L53-8","v":-8},{"$f":"AB53","v":0},0,{"$f":"AD53*Cubics","v":0},{"$f":"((($D53/Watts)/(((p_atm*0.028964)/(8.31447*(20+273.15)))*(($N53/3600)/Cubics)*(1005+1870*((0.622)/(((p_atm)/($E$12*Pvs_Heat_in))-1)))))+Tl_heat)*Celc1+Celc2","v":{"$error":"#DIV/0!"}},{"$f":"(Tl_cool-(($G53/Watts)/(1006*$N53*kgss)))*Celc1+Celc2","v":{"$error":"#DIV/0!"}},1,0,0,0,0.78069999999999995,0,{"$f":"(H53-G53)/H53","v":{"$error":"#DIV/0!"}},{"$f":"IF($X$16=1,AE53,IF($X$16=2,AL53,IF($X$16=3,BK53,IF($X$16=4,BD53,IF($X$16=5,BZ53,IF($X$16=6,BS53,IF($X$16=7,AW53,)))))))","v":0},0,0,0,0,0,0,null,null,null,null,null,null,null,null,null,null,null,null,null,null,null,null,null,null,null,null,null,null,null,null,null,1549.8924299999999,"a",373.27309722050592,"a",31,2.8,98,1806.6596173575381,"a",388.76964077650842,"a",{"$f":"BH53","v":31},2.8,98]
[null,0.4,4,{"$f":"(X54*($T$11^$Q54))*Watts*CF_Altit","v":0},{"$f":"ROUND(((D54/Watts)/(($S$9-$S$10)*1.163))*$E$14,IF($X$4=1,0,IF($X$4=2,2)))","v":0},{"$f":"($Y$54*(E54/$E$14)^$Y$56)*$F$14","v":{"$error":"#NUM!"}},{"$f":"(Z54*($W$11^R54))*Watts*CF_Altit","v":0},{"$f":"((G54/Watts)/(IF((237.3*LN((RH*EXP(17.27*(Tl_cool/(Tl_cool+237.3))))))/(17.27-LN((RH*EXP(17.27*(Tl_cool/(Tl_cool+237.3))))))<Tavg_cold,1,IF(1/(1+((2258*((0.622/(($Z$11/(1*611*EXP(17.27*(Tavg_cold/(Tavg_cold+237.3))))))-1)*1000-(0.622/(($Z$11/(RH*611*EXP(17.27*(Tl_cool/(Tl_cool+237.3))))))-1)*1000))/(1005*(Tavg_cold-Tl_cool))))*1.039+((-0.000729*$C54+0.001448)*(Tl_cool-Tavg_cold)+(0.016908*$C54-0.033574))*1.039>1,1,1/(1+((2258*((0.622/(($Z$11/(1*611*EXP(17.27*(Tavg_cold/(Tavg_cold+237.3))))))-1)*1000-(0.622/(($Z$11/(RH*611*EXP(17.27*(Tl_cool/(Tl_cool+237.3))))))-1)*1000))/(1005*(Tavg_cold-Tl_cool))))*1.039+((-0.000729*$C54+0.001448)*(Tl_cool-Tavg_cold)+(0.016908*$C54-0.033574))*1.039))))*Watts","v":0},{"$f":"ROUND(((H54/Watts)/((Tr_cool-Tv_cool)*1.163))*$I$14,IF($X$4=1,0,IF($X$4=2,2)))","v":0},{"$f":"($AA$54*(I54/$I$14)^$AA$56)*$J$14","v":{"$error":"#NUM!"}},{"$f":"L54-8","v":-8},0,0,{"$f":"AD54*Cubics","v":0},{"$f":"((($D54/Watts)/(((p_atm*0.028964)/(8.31447*(20+273.15)))*(($N54/3600)/Cubics)*(1005+1870*((0.622)/(((p_atm)/($E$12*Pvs_Heat_in))-1)))))+Tl_heat)*Celc1+Celc2","v":{"$error":"#DIV/0!"}},{"$f":"(Tl_cool-(($G54/Watts)/(1006*$N54*kgss)))*Celc1+Celc2","v":{"$error":"#DIV/0!"}},1,0,0,0,0.85870000000000002,0,{"$f":"(H54-G54)/H54","v":{"$error":"#DIV/0!"}},0,0,0,0,0,0,0,null,null,null,null,null,null,null,null,null,null,null,null,null,null,null,null,null,null,null,null,null,null,null,null,null,3091.0115699999997,9.5586899999999998E-5,677.87690553425705,1.92696346332305E-5,37,4.8,228,3995.7369439056843,7.6583688224419073E-5,705.90813123924863,{"$f":"BL54","v":7.6583688224419073E-5},37,4.8,228]
[null,0.6,6,{"$f":"(X55*($T$11^$Q55))*Watts*CF_Altit","v":0},{"$f":"ROUND(((D55/Watts)/(($S$9-$S$10)*1.163))*$E$14,IF($X$4=1,0,IF($X$4=2,2)))","v":0},{"$f":"($Y$54*(E55/$E$14)^$Y$56)*$F$14","v":{"$error":"#NUM!"}},{"$f":"(Z55*($W$11^R55))*Watts*CF_Altit","v":0},{"$f":"((G55/Watts)/(IF((237.3*LN((RH*EXP(17.27*(Tl_cool/(Tl_cool+237.3))))))/(17.27-LN((RH*EXP(17.27*(Tl_cool/(Tl_cool+237.3))))))<Tavg_cold,1,IF(1/(1+((2258*((0.622/(($Z$11/(1*611*EXP(17.27*(Tavg_cold/(Tavg_cold+237.3))))))-1)*1000-(0.622/(($Z$11/(RH*611*EXP(17.27*(Tl_cool/(Tl_cool+237.3))))))-1)*1000))/(1005*(Tavg_cold-Tl_cool))))*1.039+((-0.000729*$C55+0.001448)*(Tl_cool-Tavg_cold)+(0.016908*$C55-0.033574))*1.039>1,1,1/(1+((2258*((0.622/(($Z$11/(1*611*EXP(17.27*(Tavg_cold/(Tavg_cold+237.3))))))-1)*1000-(0.622/(($Z$11/(RH*611*EXP(17.27*(Tl_cool/(Tl_cool+237.3))))))-1)*1000))/(1005*(Tavg_cold-Tl_cool))))*1.039+((-0.000729*$C55+0.001448)*(Tl_cool-Tavg_cold)+(0.016908*$C55-0.033574))*1.039))))*Watts","v":0},{"$f":"ROUND(((H55/Watts)/((Tr_cool-Tv_cool)*1.163))*$I$14,IF($X$4=1,0,IF($X$4=2,2)))","v":0},{"$f":"($AA$54*(I55/$I$14)^$AA$56)*$J$14","v":{"$error":"#NUM!"}},{"$f":"L55-8","v":-8},0,0,{"$f":"AD55*Cubics","v":0},{"$f":"((($D55/Watts)/(((p_atm*0.028964)/(8.31447*(20+273.15)))*(($N55/3600)/Cubics)*(1005+1870*((0.622)/(((p_atm)/($E$12*Pvs_Heat_in))-1)))))+Tl_heat)*Celc1+Celc2","v":{"$error":"#DIV/0!"}},{"$f":"(Tl_cool-(($G55/Watts)/(1006*$N55*kgss)))*Celc1+Celc2","v":{"$error":"#DIV/0!"}},1,0,0,0,0.8831,0,{"$f":"(H55-G55)/H55","v":{"$error":"#DIV/0!"}},{"$f":"IF($X$16=1,AE55,IF($X$16=2,AL55,IF($X$16=3,BK55,IF($X$16=4,BD55,IF($X$16=5,BZ55,IF($X$16=6,BS55,IF($X$16=7,AW55,)))))))","v":0},0,0,0,0,0,0,null,null,null,null,null,null,null,null,null,null,null,null,null,null,null,null,null,null,null,null,null,null,null,null,null,4359.7910700000002,"b",974.52232455426361,"b",41,8.4,348,5956.5417158794371,"b",1008.1412092029277,"b",41,8.4,348]
[null,0.8,8,{"$f":"(X56*($T$11^$Q56))*Watts*CF_Altit","v":0},{"$f":"ROUND(((D56/Watts)/(($S$9-$S$10)*1.163))*$E$14,IF($X$4=1,0,IF($X$4=2,2)))","v":0},{"$f":"($Y$54*(E56/$E$14)^$Y$56)*$F$14","v":{"$error":"#NUM!"}},{"$f":"(Z56*($W$11^R56))*Watts*CF_Altit","v":0},{"$f":"((G56/Watts)/(IF((237.3*LN((RH*EXP(17.27*(Tl_cool/(Tl_cool+237.3))))))/(17.27-LN((RH*EXP(17.27*(Tl_cool/(Tl_cool+237.3))))))<Tavg_cold,1,IF(1/(1+((2258*((0.622/(($Z$11/(1*611*EXP(17.27*(Tavg_cold/(Tavg_cold+237.3))))))-1)*1000-(0.622/(($Z$11/(RH*611*EXP(17.27*(Tl_cool/(Tl_cool+237.3))))))-1)*1000))/(1005*(Tavg_cold-Tl_cool))))*1.039+((-0.000729*$C56+0.001448)*(Tl_cool-Tavg_cold)+(0.016908*$C56-0.033574))*1.039>1,1,1/(1+((2258*((0.622/(($Z$11/(1*611*EXP(17.27*(Tavg_cold/(Tavg_cold+237.3))))))-1)*1000-(0.622/(($Z$11/(RH*611*EXP(17.27*(Tl_cool/(Tl_cool+237.3))))))-1)*1000))/(1005*(Tavg_cold-Tl_cool))))*1.039+((-0.000729*$C56+0.001448)*(Tl_cool-Tavg_cold)+(0.016908*$C56-0.033574))*1.039))))*Watts","v":0},{"$f":"ROUND(((H56/Watts)/((Tr_cool-Tv_cool)*1.163))*$I$14,IF($X$4=1,0,IF($X$4=2,2)))","v":0},{"$f":"($AA$54*(I56/$I$14)^$AA$56)*$J$14","v":{"$error":"#NUM!"}},{"$f":"L56-8","v":-8},0,0,{"$f":"AD56*Cubics","v":0},{"$f":"((($D56/Watts)/(((p_atm*0.028964)/(8.31447*(20+273.15)))*(($N56/3600)/Cubics)*(1005+1870*((0.622)/(((p_atm)/($E$12*Pvs_Heat_in))-1)))))+Tl_heat)*Celc1+Celc2","v":{"$error":"#DIV/0!"}},{"$f":"(Tl_cool-(($G56/Watts)/(1006*$N56*kgss)))*Celc1+Celc2","v":{"$error":"#DIV/0!"}},1,0,0,0,0.85389999999999999,0,{"$f":"(H56-G56)/H56","v":{"$error":"#DIV/0!"}},0,0,0,0,0,0,0,null,null,null,null,null,null,null,null,null,null,null,null,null,null,null,null,null,null,null,null,null,null,null,null,null,5356.2309299999988,1.8372900000000001,1263.2093542805255,1.9149559385396036,48,14.4,470,7689.0739332787971,1.8253564962973818,1295.4688746675452,{"$f":"BL56","v":1.8253564962973818},48,14.4,470]
[null,1,10,{"$f":"(X57*($T$11^$Q57))*Watts*CF_Altit","v":0},{"$f":"ROUND(((D57/Watts)/(($S$9-$S$10)*1.163))*$E$14,IF($X$4=1,0,IF($X$4=2,2)))","v":0},{"$f":"($Y$54*(E57/$E$14)^$Y$56)*$F$14","v":{"$error":"#NUM!"}},{"$f":"(Z57*($W$11^R57))*Watts*CF_Altit","v":0},{"$f":"((G57/Watts)/(IF((237.3*LN((RH*EXP(17.27*(Tl_cool/(Tl_cool+237.3))))))/(17.27-LN((RH*EXP(17.27*(Tl_cool/(Tl_cool+237.3))))))<Tavg_cold,1,IF(1/(1+((2258*((0.622/(($Z$11/(1*611*EXP(17.27*(Tavg_cold/(Tavg_cold+237.3))))))-1)*1000-(0.622/(($Z$11/(RH*611*EXP(17.27*(Tl_cool/(Tl_cool+237.3))))))-1)*1000))/(1005*(Tavg_cold-Tl_cool))))*1.039+((-0.000729*$C57+0.001448)*(Tl_cool-Tavg_cold)+(0.016908*$C57-0.033574))*1.039>1,1,1/(1+((2258*((0.622/(($Z$11/(1*611*EXP(17.27*(Tavg_cold/(Tavg_cold+237.3))))))-1)*1000-(0.622/(($Z$11/(RH*611*EXP(17.27*(Tl_cool/(Tl_cool+237.3))))))-1)*1000))/(1005*(Tavg_cold-Tl_cool))))*1.039+((-0.000729*$C57+0.001448)*(Tl_cool-Tavg_cold)+(0.016908*$C57-0.033574))*1.039))))*Watts","v":0},{"$f":"ROUND(((H57/Watts)/((Tr_cool-Tv_cool)*1.163))*$I$14,IF($X$4=1,0,IF($X$4=2,2)))","v":0},{"$f":"($AA$54*(I57/$I$14)^$AA$56)*$J$14","v":{"$error":"#NUM!"}},{"$f":"L57-8","v":-8},0,0,{"$f":"AD57*Cubics","v":0},{"$f":"((($D57/Watts)/(((p_atm*0.028964)/(8.31447*(20+273.15)))*(($N57/3600)/Cubics)*(1005+1870*((0.622)/(((p_atm)/($E$12*Pvs_Heat_in))-1)))))+Tl_heat)*Celc1+Celc2","v":{"$error":"#DIV/0!"}},{"$f":"(Tl_cool-(($G57/Watts)/(1006*$N57*kgss)))*Celc1+Celc2","v":{"$error":"#DIV/0!"}},1,0,0,0,0.77110000000000001,0,{"$f":"(H57-G57)/H57","v":{"$error":"#DIV/0!"}},0,0,0,0,0,0,0,null,null,null,null,null,null,null,null,null,null,null,null,null,null,null,null,null,null,null,null,null,null,null,null,null,6080.3311499999982,null,1543.9379947130431,null,51,21.2,546,9193.3335961037646,null,1567.8911276331014,null,51,21.2,546]
[null,{"$f":"IF($S$7=1,NL!A57,IF(cal!$S$7=2,EN!A57,IF(cal!$S$7=3,DE!A57,IF(cal!$S$7=4,FR!A57,IF(cal!$S$7=5,NR!A57,IF(cal!$S$7=6,SP!A57,IF(cal!$S$7=7,SW!A57,IF(cal!$S$7=8,TS!A57,IF(cal!$S$7=9,ExtraTaal1!A57,IF(cal!$S$7=10,ExtraTaal2!A57,IF(cal!$S$7=11,ExtraTaal3!A57,)))))))))))","v":"Clima Canal altura 0 cm ancho 0 cm longitud 0 cm (Type 8)"},{"$f":"IF($S$7=1,NL!B57,IF(cal!$S$7=2,EN!B57,IF(cal!$S$7=3,DE!B57,IF(cal!$S$7=4,FR!B57,IF(cal!$S$7=5,NR!B57,IF(cal!$S$7=6,SP!B57,IF(cal!$S$7=7,SW!B57,IF(cal!$S$7=8,TS!B57,IF(cal!$S$7=9,ExtraTaal1!B57,IF(cal!$S$7=10,ExtraTaal2!B57,IF(cal!$S$7=11,ExtraTaal3!B57,)))))))))))","v":0},{"$f":"IF($S$7=1,NL!C57,IF(cal!$S$7=2,EN!C57,IF(cal!$S$7=3,DE!C57,IF(cal!$S$7=4,FR!C57,IF(cal!$S$7=5,NR!C57,IF(cal!$S$7=6,SP!C57,IF(cal!$S$7=7,SW!C57,IF(cal!$S$7=8,TS!C57,IF(cal!$S$7=9,ExtraTaal1!C57,IF(cal!$S$7=10,ExtraTaal2!C57,IF(cal!$S$7=11,ExtraTaal3!C57,)))))))))))","v":0},{"$f":"IF($S$7=1,NL!D57,IF(cal!$S$7=2,EN!D57,IF(cal!$S$7=3,DE!D57,IF(cal!$S$7=4,FR!D57,IF(cal!$S$7=5,NR!D57,IF(cal!$S$7=6,SP!D57,IF(cal!$S$7=7,SW!D57,IF(cal!$S$7=8,TS!D57,IF(cal!$S$7=9,ExtraTaal1!D57,IF(cal!$S$7=10,ExtraTaal2!D57,IF(cal!$S$7=11,ExtraTaal3!D57,)))))))))))","v":0},{"$f":"IF($S$7=1,NL!E57,IF(cal!$S$7=2,EN!E57,IF(cal!$S$7=3,DE!E57,IF(cal!$S$7=4,FR!E57,IF(cal!$S$7=5,NR!E57,IF(cal!$S$7=6,SP!E57,IF(cal!$S$7=7,SW!E57,IF(cal!$S$7=8,TS!E57,IF(cal!$S$7=9,ExtraTaal1!E57,IF(cal!$S$7=10,ExtraTaal2!E57,IF(cal!$S$7=11,ExtraTaal3!E57,)))))))))))","v":0},{"$f":"IF($S$7=1,NL!F57,IF(cal!$S$7=2,EN!F57,IF(cal!$S$7=3,DE!F57,IF(cal!$S$7=4,FR!F57,IF(cal!$S$7=5,NR!F57,IF(cal!$S$7=6,SP!F57,IF(cal!$S$7=7,SW!F57,IF(cal!$S$7=8,TS!F57,IF(cal!$S$7=9,ExtraTaal1!F57,IF(cal!$S$7=10,ExtraTaal2!F57,IF(cal!$S$7=11,ExtraTaal3!F57,)))))))))))","v":0},{"$f":"IF($S$7=1,NL!G57,IF(cal!$S$7=2,EN!G57,IF(cal!$S$7=3,DE!G57,IF(cal!$S$7=4,FR!G57,IF(cal!$S$7=5,NR!G57,IF(cal!$S$7=6,SP!G57,IF(cal!$S$7=7,SW!G57,IF(cal!$S$7=8,TS!G57,IF(cal!$S$7=9,ExtraTaal1!G57,IF(cal!$S$7=10,ExtraTaal2!G57,IF(cal!$S$7=11,ExtraTaal3!G57,)))))))))))","v":0},{"$f":"IF($S$7=1,NL!H57,IF(cal!$S$7=2,EN!H57,IF(cal!$S$7=3,DE!H57,IF(cal!$S$7=4,FR!H57,IF(cal!$S$7=5,NR!H57,IF(cal!$S$7=6,SP!H57,IF(cal!$S$7=7,SW!H57,IF(cal!$S$7=8,TS!H57,IF(cal!$S$7=9,ExtraTaal1!H57,IF(cal!$S$7=10,ExtraTaal2!H57,IF(cal!$S$7=11,ExtraTaal3!H57,)))))))))))","v":0},{"$f":"IF($S$7=1,NL!I57,IF(cal!$S$7=2,EN!I57,IF(cal!$S$7=3,DE!I57,IF(cal!$S$7=4,FR!I57,IF(cal!$S$7=5,NR!I57,IF(cal!$S$7=6,SP!I57,IF(cal!$S$7=7,SW!I57,IF(cal!$S$7=8,TS!I57,IF(cal!$S$7=9,ExtraTaal1!I57,IF(cal!$S$7=10,ExtraTaal2!I57,IF(cal!$S$7=11,ExtraTaal3!I57,)))))))))))","v":0},{"$f":"IF($S$7=1,NL!J57,IF(cal!$S$7=2,EN!J57,IF(cal!$S$7=3,DE!J57,IF(cal!$S$7=4,FR!J57,IF(cal!$S$7=5,NR!J57,IF(cal!$S$7=6,SP!J57,IF(cal!$S$7=7,SW!J57,IF(cal!$S$7=8,TS!J57,IF(cal!$S$7=9,ExtraTaal1!J57,IF(cal!$S$7=10,ExtraTaal2!J57,IF(cal!$S$7=11,ExtraTaal3!J57,)))))))))))","v":0},{"$f":"IF($S$7=1,NL!K57,IF(cal!$S$7=2,EN!K57,IF(cal!$S$7=3,DE!K57,IF(cal!$S$7=4,FR!K57,IF(cal!$S$7=5,NR!K57,IF(cal!$S$7=6,SP!K57,IF(cal!$S$7=7,SW!K57,IF(cal!$S$7=8,TS!K57,IF(cal!$S$7=9,ExtraTaal1!K57,IF(cal!$S$7=10,ExtraTaal2!K57,IF(cal!$S$7=11,ExtraTaal3!K57,)))))))))))","v":0},{"$f":"IF($S$7=1,NL!L57,IF(cal!$S$7=2,EN!L57,IF(cal!$S$7=3,DE!L57,IF(cal!$S$7=4,FR!L57,IF(cal!$S$7=5,NR!L57,IF(cal!$S$7=6,SP!L57,IF(cal!$S$7=7,SW!L57,IF(cal!$S$7=8,TS!L57,IF(cal!$S$7=9,ExtraTaal1!L57,IF(cal!$S$7=10,ExtraTaal2!L57,IF(cal!$S$7=11,ExtraTaal3!L57,)))))))))))","v":0},{"$f":"IF($S$7=1,NL!M57,IF(cal!$S$7=2,EN!M57,IF(cal!$S$7=3,DE!M57,IF(cal!$S$7=4,FR!M57,IF(cal!$S$7=5,NR!M57,IF(cal!$S$7=6,SP!M57,IF(cal!$S$7=7,SW!M57,IF(cal!$S$7=8,TS!M57,IF(cal!$S$7=9,ExtraTaal1!M57,IF(cal!$S$7=10,ExtraTaal2!M57,IF(cal!$S$7=11,ExtraTaal3!M57,)))))))))))","v":0},{"$f":"IF($S$7=1,NL!N57,IF(cal!$S$7=2,EN!N57,IF(cal!$S$7=3,DE!N57,IF(cal!$S$7=4,FR!N57,IF(cal!$S$7=5,NR!N57,IF(cal!$S$7=6,SP!N57,IF(cal!$S$7=7,SW!N57,IF(cal!$S$7=8,TS!N57,IF(cal!$S$7=9,ExtraTaal1!N57,IF(cal!$S$7=10,ExtraTaal2!N57,IF(cal!$S$7=11,ExtraTaal3!N57,)))))))))))","v":0},{"$f":"IF($S$7=1,NL!O57,IF(cal!$S$7=2,EN!O57,IF(cal!$S$7=3,DE!O57,IF(cal!$S$7=4,FR!O57,IF(cal!$S$7=5,NR!O57,IF(cal!$S$7=6,SP!O57,IF(cal!$S$7=7,SW!O57,IF(cal!$S$7=8,TS!O57,IF(cal!$S$7=9,ExtraTaal1!O57,IF(cal!$S$7=10,ExtraTaal2!O57,IF(cal!$S$7=11,ExtraTaal3!O57,)))))))))))","v":0},"n-value","n-value","n-value","n-value","n-value","n-value",null,0,0,0,0,0,0,0,null,null,null,null,null,null,null,null,null,null,null,null,null,null,null,null,null,null,null,null,null,null,null,null,null,"H",{"$f":"BE22","v":13},"B",{"$f":"BG22","v":32},"L",{"$f":"IF($X$4=1,230,230/2.54)","v":230},null,"H",{"$f":"BL22","v":13},"B",{"$f":"BN22","v":32},"L",{"$f":"IF($X$4=1,230,230/2.54)","v":230}]
[null,0.2,2,{"$f":"(X59*($T$11^$Q59))*Watts*CF_Altit","v":0},{"$f":"ROUND(((D59/Watts)/(($S$9-$S$10)*1.163))*$E$14,IF($X$4=1,0,IF($X$4=2,2)))","v":0},{"$f":"($Y$66*(E59/$E$14)^$Y$68)*$F$14","v":{"$error":"#NUM!"}},{"$f":"(Z59*($W$11^R59))*Watts*CF_Altit","v":0},{"$f":"((G59/Watts)/(IF((237.3*LN((RH*EXP(17.27*(Tl_cool/(Tl_cool+237.3))))))/(17.27-LN((RH*EXP(17.27*(Tl_cool/(Tl_cool+237.3))))))<Tavg_cold,1,IF(1/(1+((2258*((0.622/(($Z$11/(1*611*EXP(17.27*(Tavg_cold/(Tavg_cold+237.3))))))-1)*1000-(0.622/(($Z$11/(RH*611*EXP(17.27*(Tl_cool/(Tl_cool+237.3))))))-1)*1000))/(1005*(Tavg_cold-Tl_cool))))*1.039+((-0.000729*$C59+0.001448)*(Tl_cool-Tavg_cold)+(0.016908*$C59-0.033574))*1.039>1,1,1/(1+((2258*((0.622/(($Z$11/(1*611*EXP(17.27*(Tavg_cold/(Tavg_cold+237.3))))))-1)*1000-(0.622/(($Z$11/(RH*611*EXP(17.27*(Tl_cool/(Tl_cool+237.3))))))-1)*1000))/(1005*(Tavg_cold-Tl_cool))))*1.039+((-0.000729*$C59+0.001448)*(Tl_cool-Tavg_cold)+(0.016908*$C59-0.033574))*1.039))))*Watts","v":0},{"$f":"ROUND(((H59/Watts)/((Tr_cool-Tv_cool)*1.163))*$I$14,IF($X$4=1,0,IF($X$4=2,2)))","v":0},{"$f":"($AA$60*(I59/$I$14)^$AA$62)*$J$14","v":{"$error":"#NUM!"}},{"$f":"L59-8","v":-8},{"$f":"AB59","v":0},0,{"$f":"AD59*Cubics","v":0},{"$f":"((($D59/Watts)/(((p_atm*0.028964)/(8.31447*(20+273.15)))*(($N59/3600)/Cubics)*(1005+1870*((0.622)/(((p_atm)/($E$12*Pvs_Heat_in))-1)))))+Tl_heat)*Celc1+Celc2","v":{"$error":"#DIV/0!"}},{"$f":"(Tl_cool-(($G59/Watts)/(1006*$N59*kgss)))*Celc1+Celc2","v":{"$error":"#DIV/0!"}},1,0,0,0,0.78069999999999995,0,{"$f":"(H59-G59)/H59","v":{"$error":"#DIV/0!"}},{"$f":"IF($X$16=1,AE59,IF($X$16=2,AL59,IF($X$16=3,BK59,IF($X$16=4,BD59,IF($X$16=5,BZ59,IF($X$16=6,BS59,IF($X$16=7,AW59,)))))))","v":0},0,0,0,0,0,0,null,null,null,null,null,null,null,null,null,null,null,null,null,null,null,null,null,null,null,null,null,null,null,null,null,1950.3814299999999,"a",469.72609391831105,"a",32,3.7839999999999998,133,2273.4967277858427,"a",489.22691229498605,"a",{"$f":"BH59","v":32},3.7839999999999998,133]
[null,0.4,4,{"$f":"(X60*($T$11^$Q60))*Watts*CF_Altit","v":0},{"$f":"ROUND(((D60/Watts)/(($S$9-$S$10)*1.163))*$E$14,IF($X$4=1,0,IF($X$4=2,2)))","v":0},{"$f":"($Y$66*(E60/$E$14)^$Y$68)*$F$14","v":{"$error":"#NUM!"}},{"$f":"(Z60*($W$11^R60))*Watts*CF_Altit","v":0},{"$f":"((G60/Watts)/(IF((237.3*LN((RH*EXP(17.27*(Tl_cool/(Tl_cool+237.3))))))/(17.27-LN((RH*EXP(17.27*(Tl_cool/(Tl_cool+237.3))))))<Tavg_cold,1,IF(1/(1+((2258*((0.622/(($Z$11/(1*611*EXP(17.27*(Tavg_cold/(Tavg_cold+237.3))))))-1)*1000-(0.622/(($Z$11/(RH*611*EXP(17.27*(Tl_cool/(Tl_cool+237.3))))))-1)*1000))/(1005*(Tavg_cold-Tl_cool))))*1.039+((-0.000729*$C60+0.001448)*(Tl_cool-Tavg_cold)+(0.016908*$C60-0.033574))*1.039>1,1,1/(1+((2258*((0.622/(($Z$11/(1*611*EXP(17.27*(Tavg_cold/(Tavg_cold+237.3))))))-1)*1000-(0.622/(($Z$11/(RH*611*EXP(17.27*(Tl_cool/(Tl_cool+237.3))))))-1)*1000))/(1005*(Tavg_cold-Tl_cool))))*1.039+((-0.000729*$C60+0.001448)*(Tl_cool-Tavg_cold)+(0.016908*$C60-0.033574))*1.039))))*Watts","v":0},{"$f":"ROUND(((H60/Watts)/((Tr_cool-Tv_cool)*1.163))*$I$14,IF($X$4=1,0,IF($X$4=2,2)))","v":0},{"$f":"($AA$60*(I60/$I$14)^$AA$62)*$J$14","v":{"$error":"#NUM!"}},{"$f":"L60-8","v":-8},0,0,{"$f":"AD60*Cubics","v":0},{"$f":"((($D60/Watts)/(((p_atm*0.028964)/(8.31447*(20+273.15)))*(($N60/3600)/Cubics)*(1005+1870*((0.622)/(((p_atm)/($E$12*Pvs_Heat_in))-1)))))+Tl_heat)*Celc1+Celc2","v":{"$error":"#DIV/0!"}},{"$f":"(Tl_cool-(($G60/Watts)/(1006*$N60*kgss)))*Celc1+Celc2","v":{"$error":"#DIV/0!"}},1,0,0,0,0.85870000000000002,0,{"$f":"(H60-G60)/H60","v":{"$error":"#DIV/0!"}},0,0,0,0,0,0,0,null,null,null,null,null,null,null,null,null,null,null,null,null,null,null,null,null,null,null,null,null,null,null,null,null,3889.7225699999995,1.18103E-4,853.03889662838037,2.1811428519254933E-5,37.5,6.4320000000000004,272,5028.227110289582,9.6910939216495503E-5,888.31333310985553,{"$f":"BL60","v":9.6910939216495503E-5},37.5,6.4320000000000004,272]
[null,0.6,6,{"$f":"(X61*($T$11^$Q61))*Watts*CF_Altit","v":0},{"$f":"ROUND(((D61/Watts)/(($S$9-$S$10)*1.163))*$E$14,IF($X$4=1,0,IF($X$4=2,2)))","v":0},{"$f":"($Y$66*(E61/$E$14)^$Y$68)*$F$14","v":{"$error":"#NUM!"}},{"$f":"(Z61*($W$11^R61))*Watts*CF_Altit","v":0},{"$f":"((G61/Watts)/(IF((237.3*LN((RH*EXP(17.27*(Tl_cool/(Tl_cool+237.3))))))/(17.27-LN((RH*EXP(17.27*(Tl_cool/(Tl_cool+237.3))))))<Tavg_cold,1,IF(1/(1+((2258*((0.622/(($Z$11/(1*611*EXP(17.27*(Tavg_cold/(Tavg_cold+237.3))))))-1)*1000-(0.622/(($Z$11/(RH*611*EXP(17.27*(Tl_cool/(Tl_cool+237.3))))))-1)*1000))/(1005*(Tavg_cold-Tl_cool))))*1.039+((-0.000729*$C61+0.001448)*(Tl_cool-Tavg_cold)+(0.016908*$C61-0.033574))*1.039>1,1,1/(1+((2258*((0.622/(($Z$11/(1*611*EXP(17.27*(Tavg_cold/(Tavg_cold+237.3))))))-1)*1000-(0.622/(($Z$11/(RH*611*EXP(17.27*(Tl_cool/(Tl_cool+237.3))))))-1)*1000))/(1005*(Tavg_cold-Tl_cool))))*1.039+((-0.000729*$C61+0.001448)*(Tl_cool-Tavg_cold)+(0.016908*$C61-0.033574))*1.039))))*Watts","v":0},{"$f":"ROUND(((H61/Watts)/((Tr_cool-Tv_cool)*1.163))*$I$14,IF($X$4=1,0,IF($X$4=2,2)))","v":0},{"$f":"($AA$60*(I61/$I$14)^$AA$62)*$J$14","v":{"$error":"#NUM!"}},{"$f":"L61-8","v":-8},0,0,{"$f":"AD61*Cubics","v":0},{"$f":"((($D61/Watts)/(((p_atm*0.028964)/(8.31447*(20+273.15)))*(($N61/3600)/Cubics)*(1005+1870*((0.622)/(((p_atm)/($E$12*Pvs_Heat_in))-1)))))+Tl_heat)*Celc1+Celc2","v":{"$error":"#DIV/0!"}},{"$f":"(Tl_cool-(($G61/Watts)/(1006*$N61*kgss)))*Celc1+Celc2","v":{"$error":"#DIV/0!"}},1,0,0,0,0.8831,0,{"$f":"(H61-G61)/H61","v":{"$error":"#DIV/0!"}},{"$f":"IF($X$16=1,AE61,IF($X$16=2,AL61,IF($X$16=3,BK61,IF($X$16=4,BD61,IF($X$16=5,BZ61,IF($X$16=6,BS61,IF($X$16=7,AW61,)))))))","v":0},0,0,0,0,0,0,null,null,null,null,null,null,null,null,null,null,null,null,null,null,null,null,null,null,null,null,null,null,null,null,null,5486.3520699999999,"b",1226.336878702652,"b",42,11.600000000000001,433,7495.6997819981552,"b",1268.6428136481286,"b",42,11.600000000000001,433]
[null,0.8,8,{"$f":"(X62*($T$11^$Q62))*Watts*CF_Altit","v":0},{"$f":"ROUND(((D62/Watts)/(($S$9-$S$10)*1.163))*$E$14,IF($X$4=1,0,IF($X$4=2,2)))","v":0},{"$f":"($Y$66*(E62/$E$14)^$Y$68)*$F$14","v":{"$error":"#NUM!"}},{"$f":"(Z62*($W$11^R62))*Watts*CF_Altit","v":0},{"$f":"((G62/Watts)/(IF((237.3*LN((RH*EXP(17.27*(Tl_cool/(Tl_cool+237.3))))))/(17.27-LN((RH*EXP(17.27*(Tl_cool/(Tl_cool+237.3))))))<Tavg_cold,1,IF(1/(1+((2258*((0.622/(($Z$11/(1*611*EXP(17.27*(Tavg_cold/(Tavg_cold+237.3))))))-1)*1000-(0.622/(($Z$11/(RH*611*EXP(17.27*(Tl_cool/(Tl_cool+237.3))))))-1)*1000))/(1005*(Tavg_cold-Tl_cool))))*1.039+((-0.000729*$C62+0.001448)*(Tl_cool-Tavg_cold)+(0.016908*$C62-0.033574))*1.039>1,1,1/(1+((2258*((0.622/(($Z$11/(1*611*EXP(17.27*(Tavg_cold/(Tavg_cold+237.3))))))-1)*1000-(0.622/(($Z$11/(RH*611*EXP(17.27*(Tl_cool/(Tl_cool+237.3))))))-1)*1000))/(1005*(Tavg_cold-Tl_cool))))*1.039+((-0.000729*$C62+0.001448)*(Tl_cool-Tavg_cold)+(0.016908*$C62-0.033574))*1.039))))*Watts","v":0},{"$f":"ROUND(((H62/Watts)/((Tr_cool-Tv_cool)*1.163))*$I$14,IF($X$4=1,0,IF($X$4=2,2)))","v":0},{"$f":"($AA$60*(I62/$I$14)^$AA$62)*$J$14","v":{"$error":"#NUM!"}},{"$f":"L62-8","v":-8},0,0,{"$f":"AD62*Cubics","v":0},{"$f":"((($D62/Watts)/(((p_atm*0.028964)/(8.31447*(20+273.15)))*(($N62/3600)/Cubics)*(1005+1870*((0.622)/(((p_atm)/($E$12*Pvs_Heat_in))-1)))))+Tl_heat)*Celc1+Celc2","v":{"$error":"#DIV/0!"}},{"$f":"(Tl_cool-(($G62/Watts)/(1006*$N62*kgss)))*Celc1+Celc2","v":{"$error":"#DIV/0!"}},1,0,0,0,0.85389999999999999,0,{"$f":"(H62-G62)/H62","v":{"$error":"#DIV/0!"}},0,0,0,0,0,0,0,null,null,null,null,null,null,null,null,null,null,null,null,null,null,null,null,null,null,null,null,null,null,null,null,null,6740.2699299999986,1.82623,1589.6200401411263,1.9055926159320533,49,20.3,587,9675.9147429115619,1.8118808069056789,1630.2153539098049,{"$f":"BL62","v":1.8118808069056789},49,20.3,587]
[null,1,10,{"$f":"(X63*($T$11^$Q63))*Watts*CF_Altit","v":0},{"$f":"ROUND(((D63/Watts)/(($S$9-$S$10)*1.163))*$E$14,IF($X$4=1,0,IF($X$4=2,2)))","v":0},{"$f":"($Y$66*(E63/$E$14)^$Y$68)*$F$14","v":{"$error":"#NUM!"}},{"$f":"(Z63*($W$11^R63))*Watts*CF_Altit","v":0},{"$f":"((G63/Watts)/(IF((237.3*LN((RH*EXP(17.27*(Tl_cool/(Tl_cool+237.3))))))/(17.27-LN((RH*EXP(17.27*(Tl_cool/(Tl_cool+237.3))))))<Tavg_cold,1,IF(1/(1+((2258*((0.622/(($Z$11/(1*611*EXP(17.27*(Tavg_cold/(Tavg_cold+237.3))))))-1)*1000-(0.622/(($Z$11/(RH*611*EXP(17.27*(Tl_cool/(Tl_cool+237.3))))))-1)*1000))/(1005*(Tavg_cold-Tl_cool))))*1.039+((-0.000729*$C63+0.001448)*(Tl_cool-Tavg_cold)+(0.016908*$C63-0.033574))*1.039>1,1,1/(1+((2258*((0.622/(($Z$11/(1*611*EXP(17.27*(Tavg_cold/(Tavg_cold+237.3))))))-1)*1000-(0.622/(($Z$11/(RH*611*EXP(17.27*(Tl_cool/(Tl_cool+237.3))))))-1)*1000))/(1005*(Tavg_cold-Tl_cool))))*1.039+((-0.000729*$C63+0.001448)*(Tl_cool-Tavg_cold)+(0.016908*$C63-0.033574))*1.039))))*Watts","v":0},{"$f":"ROUND(((H63/Watts)/((Tr_cool-Tv_cool)*1.163))*$I$14,IF($X$4=1,0,IF($X$4=2,2)))","v":0},{"$f":"($AA$60*(I63/$I$14)^$AA$62)*$J$14","v":{"$error":"#NUM!"}},{"$f":"L63-8","v":-8},0,0,{"$f":"AD63*Cubics","v":0},{"$f":"((($D63/Watts)/(((p_atm*0.028964)/(8.31447*(20+273.15)))*(($N63/3600)/Cubics)*(1005+1870*((0.622)/(((p_atm)/($E$12*Pvs_Heat_in))-1)))))+Tl_heat)*Celc1+Celc2","v":{"$error":"#DIV/0!"}},{"$f":"(Tl_cool-(($G63/Watts)/(1006*$N63*kgss)))*Celc1+Celc2","v":{"$error":"#DIV/0!"}},1,0,0,0,0.77110000000000001,0,{"$f":"(H63-G63)/H63","v":{"$error":"#DIV/0!"}},0,0,0,0,0,0,0,null,null,null,null,null,null,null,null,null,null,null,null,null,null,null,null,null,null,null,null,null,null,null,null,null,7651.4761499999977,null,1942.8883809438034,null,52,30,683,11568.871993029803,null,1973.0309538948848,null,52,30,683]
[null,{"$f":"IF($S$7=1,NL!A63,IF(cal!$S$7=2,EN!A63,IF(cal!$S$7=3,DE!A63,IF(cal!$S$7=4,FR!A63,IF(cal!$S$7=5,NR!A63,IF(cal!$S$7=6,SP!A63,IF(cal!$S$7=7,SW!A63,IF(cal!$S$7=8,TS!A63,IF(cal!$S$7=9,ExtraTaal1!A63,IF(cal!$S$7=10,ExtraTaal2!A63,IF(cal!$S$7=11,ExtraTaal3!A63,)))))))))))","v":"Clima Canal altura 0 cm ancho 0 cm longitud 0 cm (Type 9)"},{"$f":"IF($S$7=1,NL!B63,IF(cal!$S$7=2,EN!B63,IF(cal!$S$7=3,DE!B63,IF(cal!$S$7=4,FR!B63,IF(cal!$S$7=5,NR!B63,IF(cal!$S$7=6,SP!B63,IF(cal!$S$7=7,SW!B63,IF(cal!$S$7=8,TS!B63,IF(cal!$S$7=9,ExtraTaal1!B63,IF(cal!$S$7=10,ExtraTaal2!B63,IF(cal!$S$7=11,ExtraTaal3!B63,)))))))))))","v":0},{"$f":"IF($S$7=1,NL!C63,IF(cal!$S$7=2,EN!C63,IF(cal!$S$7=3,DE!C63,IF(cal!$S$7=4,FR!C63,IF(cal!$S$7=5,NR!C63,IF(cal!$S$7=6,SP!C63,IF(cal!$S$7=7,SW!C63,IF(cal!$S$7=8,TS!C63,IF(cal!$S$7=9,ExtraTaal1!C63,IF(cal!$S$7=10,ExtraTaal2!C63,IF(cal!$S$7=11,ExtraTaal3!C63,)))))))))))","v":0},{"$f":"IF($S$7=1,NL!D63,IF(cal!$S$7=2,EN!D63,IF(cal!$S$7=3,DE!D63,IF(cal!$S$7=4,FR!D63,IF(cal!$S$7=5,NR!D63,IF(cal!$S$7=6,SP!D63,IF(cal!$S$7=7,SW!D63,IF(cal!$S$7=8,TS!D63,IF(cal!$S$7=9,ExtraTaal1!D63,IF(cal!$S$7=10,ExtraTaal2!D63,IF(cal!$S$7=11,ExtraTaal3!D63,)))))))))))","v":0},{"$f":"IF($S$7=1,NL!E63,IF(cal!$S$7=2,EN!E63,IF(cal!$S$7=3,DE!E63,IF(cal!$S$7=4,FR!E63,IF(cal!$S$7=5,NR!E63,IF(cal!$S$7=6,SP!E63,IF(cal!$S$7=7,SW!E63,IF(cal!$S$7=8,TS!E63,IF(cal!$S$7=9,ExtraTaal1!E63,IF(cal!$S$7=10,ExtraTaal2!E63,IF(cal!$S$7=11,ExtraTaal3!E63,)))))))))))","v":0},{"$f":"IF($S$7=1,NL!F63,IF(cal!$S$7=2,EN!F63,IF(cal!$S$7=3,DE!F63,IF(cal!$S$7=4,FR!F63,IF(cal!$S$7=5,NR!F63,IF(cal!$S$7=6,SP!F63,IF(cal!$S$7=7,SW!F63,IF(cal!$S$7=8,TS!F63,IF(cal!$S$7=9,ExtraTaal1!F63,IF(cal!$S$7=10,ExtraTaal2!F63,IF(cal!$S$7=11,ExtraTaal3!F63,)))))))))))","v":0},{"$f":"IF($S$7=1,NL!G63,IF(cal!$S$7=2,EN!G63,IF(cal!$S$7=3,DE!G63,IF(cal!$S$7=4,FR!G63,IF(cal!$S$7=5,NR!G63,IF(cal!$S$7=6,SP!G63,IF(cal!$S$7=7,SW!G63,IF(cal!$S$7=8,TS!G63,IF(cal!$S$7=9,ExtraTaal1!G63,IF(cal!$S$7=10,ExtraTaal2!G63,IF(cal!$S$7=11,ExtraTaal3!G63,)))))))))))","v":0},{"$f":"IF($S$7=1,NL!H63,IF(cal!$S$7=2,EN!H63,IF(cal!$S$7=3,DE!H63,IF(cal!$S$7=4,FR!H63,IF(cal!$S$7=5,NR!H63,IF(cal!$S$7=6,SP!H63,IF(cal!$S$7=7,SW!H63,IF(cal!$S$7=8,TS!H63,IF(cal!$S$7=9,ExtraTaal1!H63,IF(cal!$S$7=10,ExtraTaal2!H63,IF(cal!$S$7=11,ExtraTaal3!H63,)))))))))))","v":0},{"$f":"IF($S$7=1,NL!I63,IF(cal!$S$7=2,EN!I63,IF(cal!$S$7=3,DE!I63,IF(cal!$S$7=4,FR!I63,IF(cal!$S$7=5,NR!I63,IF(cal!$S$7=6,SP!I63,IF(cal!$S$7=7,SW!I63,IF(cal!$S$7=8,TS!I63,IF(cal!$S$7=9,ExtraTaal1!I63,IF(cal!$S$7=10,ExtraTaal2!I63,IF(cal!$S$7=11,ExtraTaal3!I63,)))))))))))","v":0},{"$f":"IF($S$7=1,NL!J63,IF(cal!$S$7=2,EN!J63,IF(cal!$S$7=3,DE!J63,IF(cal!$S$7=4,FR!J63,IF(cal!$S$7=5,NR!J63,IF(cal!$S$7=6,SP!J63,IF(cal!$S$7=7,SW!J63,IF(cal!$S$7=8,TS!J63,IF(cal!$S$7=9,ExtraTaal1!J63,IF(cal!$S$7=10,ExtraTaal2!J63,IF(cal!$S$7=11,ExtraTaal3!J63,)))))))))))","v":0},{"$f":"IF($S$7=1,NL!K63,IF(cal!$S$7=2,EN!K63,IF(cal!$S$7=3,DE!K63,IF(cal!$S$7=4,FR!K63,IF(cal!$S$7=5,NR!K63,IF(cal!$S$7=6,SP!K63,IF(cal!$S$7=7,SW!K63,IF(cal!$S$7=8,TS!K63,IF(cal!$S$7=9,ExtraTaal1!K63,IF(cal!$S$7=10,ExtraTaal2!K63,IF(cal!$S$7=11,ExtraTaal3!K63,)))))))))))","v":0},{"$f":"IF($S$7=1,NL!L63,IF(cal!$S$7=2,EN!L63,IF(cal!$S$7=3,DE!L63,IF(cal!$S$7=4,FR!L63,IF(cal!$S$7=5,NR!L63,IF(cal!$S$7=6,SP!L63,IF(cal!$S$7=7,SW!L63,IF(cal!$S$7=8,TS!L63,IF(cal!$S$7=9,ExtraTaal1!L63,IF(cal!$S$7=10,ExtraTaal2!L63,IF(cal!$S$7=11,ExtraTaal3!L63,)))))))))))","v":0},{"$f":"IF($S$7=1,NL!M63,IF(cal!$S$7=2,EN!M63,IF(cal!$S$7=3,DE!M63,IF(cal!$S$7=4,FR!M63,IF(cal!$S$7=5,NR!M63,IF(cal!$S$7=6,SP!M63,IF(cal!$S$7=7,SW!M63,IF(cal!$S$7=8,TS!M63,IF(cal!$S$7=9,ExtraTaal1!M63,IF(cal!$S$7=10,ExtraTaal2!M63,IF(cal!$S$7=11,ExtraTaal3!M63,)))))))))))","v":0},{"$f":"IF($S$7=1,NL!N63,IF(cal!$S$7=2,EN!N63,IF(cal!$S$7=3,DE!N63,IF(cal!$S$7=4,FR!N63,IF(cal!$S$7=5,NR!N63,IF(cal!$S$7=6,SP!N63,IF(cal!$S$7=7,SW!N63,IF(cal!$S$7=8,TS!N63,IF(cal!$S$7=9,ExtraTaal1!N63,IF(cal!$S$7=10,ExtraTaal2!N63,IF(cal!$S$7=11,ExtraTaal3!N63,)))))))))))","v":0},{"$f":"IF($S$7=1,NL!O63,IF(cal!$S$7=2,EN!O63,IF(cal!$S$7=3,DE!O63,IF(cal!$S$7=4,FR!O63,IF(cal!$S$7=5,NR!O63,IF(cal!$S$7=6,SP!O63,IF(cal!$S$7=7,SW!O63,IF(cal!$S$7=8,TS!O63,IF(cal!$S$7=9,ExtraTaal1!O63,IF(cal!$S$7=10,ExtraTaal2!O63,IF(cal!$S$7=11,ExtraTaal3!O63,)))))))))))","v":0},"n-value","n-value","n-value","n-value","n-value","n-value",null,0,0,0,0,0,0,0,null,null,null,null,null,null,null,null,null,null,null,null,null,null,null,null,null,null,null,null,null,null,null,null,null,"H",{"$f":"BE22","v":13},"B",{"$f":"BG22","v":32},"L",{"$f":"IF($X$4=1,280,280/2.54)","v":280},null,"H",{"$f":"BL22","v":13},"B",{"$f":"BN22","v":32},"L",{"$f":"IF($X$4=1,280,280/2.54)","v":280}]
[null,0.2,2,{"$f":"(X65*($T$11^$Q65))*Watts*CF_Altit","v":0},{"$f":"ROUND(((D65/Watts)/(($S$9-$S$10)*1.163))*$E$14,IF($X$4=1,0,IF($X$4=2,2)))","v":0},{"$f":"($Y$66*(E65/$E$14)^$Y$68)*$F$14","v":{"$error":"#NUM!"}},{"$f":"(Z65*($W$11^R65))*Watts*CF_Altit","v":0},{"$f":"((G65/Watts)/(IF((237.3*LN((RH*EXP(17.27*(Tl_cool/(Tl_cool+237.3))))))/(17.27-LN((RH*EXP(17.27*(Tl_cool/(Tl_cool+237.3))))))<Tavg_cold,1,IF(1/(1+((2258*((0.622/(($Z$11/(1*611*EXP(17.27*(Tavg_cold/(Tavg_cold+237.3))))))-1)*1000-(0.622/(($Z$11/(RH*611*EXP(17.27*(Tl_cool/(Tl_cool+237.3))))))-1)*1000))/(1005*(Tavg_cold-Tl_cool))))*1.039+((-0.000729*$C65+0.001448)*(Tl_cool-Tavg_cold)+(0.016908*$C65-0.033574))*1.039>1,1,1/(1+((2258*((0.622/(($Z$11/(1*611*EXP(17.27*(Tavg_cold/(Tavg_cold+237.3))))))-1)*1000-(0.622/(($Z$11/(RH*611*EXP(17.27*(Tl_cool/(Tl_cool+237.3))))))-1)*1000))/(1005*(Tavg_cold-Tl_cool))))*1.039+((-0.000729*$C65+0.001448)*(Tl_cool-Tavg_cold)+(0.016908*$C65-0.033574))*1.039))))*Watts","v":0},{"$f":"ROUND(((H65/Watts)/((Tr_cool-Tv_cool)*1.163))*$I$14,IF($X$4=1,0,IF($X$4=2,2)))","v":0},{"$f":"($AA$66*(I65/$I$14)^$AA$68)*$J$14","v":{"$error":"#NUM!"}},{"$f":"L65-8","v":-8},{"$f":"AB65","v":0},0,{"$f":"AD65*Cubics","v":0},{"$f":"((($D65/Watts)/(((p_atm*0.028964)/(8.31447*(20+273.15)))*(($N65/3600)/Cubics)*(1005+1870*((0.622)/(((p_atm)/($E$12*Pvs_Heat_in))-1)))))+Tl_heat)*Celc1+Celc2","v":{"$error":"#DIV/0!"}},{"$f":"(Tl_cool-(($G65/Watts)/(1006*$N65*kgss)))*Celc1+Celc2","v":{"$error":"#DIV/0!"}},1,0,0,0,0.78069999999999995,0,{"$f":"(H65-G65)/H65","v":{"$error":"#DIV/0!"}},{"$f":"IF($X$16=1,AE65,IF($X$16=2,AL65,IF($X$16=3,BK65,IF($X$16=4,BD65,IF($X$16=5,BZ65,IF($X$16=6,BS65,IF($X$16=7,AW65,)))))))","v":0},0,0,0,0,0,0,null,null,null,null,null,null,null,null,null,null,null,null,null,null,null,null,null,null,null,null,null,null,null,null,null,2110.58,"a",508.31900000000002,"a",33,4.8,142,2460.2200000000003,"a",529.39599999999996,"a",{"$f":"BH65","v":33},4.8,142]
[null,0.4,4,{"$f":"(X66*($T$11^$Q66))*Watts*CF_Altit","v":0},{"$f":"ROUND(((D66/Watts)/(($S$9-$S$10)*1.163))*$E$14,IF($X$4=1,0,IF($X$4=2,2)))","v":0},{"$f":"($Y$66*(E66/$E$14)^$Y$68)*$F$14","v":{"$error":"#NUM!"}},{"$f":"(Z66*($W$11^R66))*Watts*CF_Altit","v":0},{"$f":"((G66/Watts)/(IF((237.3*LN((RH*EXP(17.27*(Tl_cool/(Tl_cool+237.3))))))/(17.27-LN((RH*EXP(17.27*(Tl_cool/(Tl_cool+237.3))))))<Tavg_cold,1,IF(1/(1+((2258*((0.622/(($Z$11/(1*611*EXP(17.27*(Tavg_cold/(Tavg_cold+237.3))))))-1)*1000-(0.622/(($Z$11/(RH*611*EXP(17.27*(Tl_cool/(Tl_cool+237.3))))))-1)*1000))/(1005*(Tavg_cold-Tl_cool))))*1.039+((-0.000729*$C66+0.001448)*(Tl_cool-Tavg_cold)+(0.016908*$C66-0.033574))*1.039>1,1,1/(1+((2258*((0.622/(($Z$11/(1*611*EXP(17.27*(Tavg_cold/(Tavg_cold+237.3))))))-1)*1000-(0.622/(($Z$11/(RH*611*EXP(17.27*(Tl_cool/(Tl_cool+237.3))))))-1)*1000))/(1005*(Tavg_cold-Tl_cool))))*1.039+((-0.000729*$C66+0.001448)*(Tl_cool-Tavg_cold)+(0.016908*$C66-0.033574))*1.039))))*Watts","v":0},{"$f":"ROUND(((H66/Watts)/((Tr_cool-Tv_cool)*1.163))*$I$14,IF($X$4=1,0,IF($X$4=2,2)))","v":0},{"$f":"($AA$66*(I66/$I$14)^$AA$68)*$J$14","v":{"$error":"#NUM!"}},{"$f":"L66-8","v":-8},0,0,{"$f":"AD66*Cubics","v":0},{"$f":"((($D66/Watts)/(((p_atm*0.028964)/(8.31447*(20+273.15)))*(($N66/3600)/Cubics)*(1005+1870*((0.622)/(((p_atm)/($E$12*Pvs_Heat_in))-1)))))+Tl_heat)*Celc1+Celc2","v":{"$error":"#DIV/0!"}},{"$f":"(Tl_cool-(($G66/Watts)/(1006*$N66*kgss)))*Celc1+Celc2","v":{"$error":"#DIV/0!"}},1,0,0,0,0.85870000000000002,0,{"$f":"(H66-G66)/H66","v":{"$error":"#DIV/0!"}},0,0,0,0,0,0,0,null,null,null,null,null,null,null,null,null,null,null,null,null,null,null,null,null,null,null,null,null,null,null,null,null,4209.1399999999994,1.2333900000000001E-4,923.09,2.4628161336117001E-5,39,8,313,5441.28,1.0103900000000001E-4,961.2700000000001,{"$f":"BL66","v":1.0103900000000001E-4},39,8,313]
[null,0.6,6,{"$f":"(X67*($T$11^$Q67))*Watts*CF_Altit","v":0},{"$f":"ROUND(((D67/Watts)/(($S$9-$S$10)*1.163))*$E$14,IF($X$4=1,0,IF($X$4=2,2)))","v":0},{"$f":"($Y$66*(E67/$E$14)^$Y$68)*$F$14","v":{"$error":"#NUM!"}},{"$f":"(Z67*($W$11^R67))*Watts*CF_Altit","v":0},{"$f":"((G67/Watts)/(IF((237.3*LN((RH*EXP(17.27*(Tl_cool/(Tl_cool+237.3))))))/(17.27-LN((RH*EXP(17.27*(Tl_cool/(Tl_cool+237.3))))))<Tavg_cold,1,IF(1/(1+((2258*((0.622/(($Z$11/(1*611*EXP(17.27*(Tavg_cold/(Tavg_cold+237.3))))))-1)*1000-(0.622/(($Z$11/(RH*611*EXP(17.27*(Tl_cool/(Tl_cool+237.3))))))-1)*1000))/(1005*(Tavg_cold-Tl_cool))))*1.039+((-0.000729*$C67+0.001448)*(Tl_cool-Tavg_cold)+(0.016908*$C67-0.033574))*1.039>1,1,1/(1+((2258*((0.622/(($Z$11/(1*611*EXP(17.27*(Tavg_cold/(Tavg_cold+237.3))))))-1)*1000-(0.622/(($Z$11/(RH*611*EXP(17.27*(Tl_cool/(Tl_cool+237.3))))))-1)*1000))/(1005*(Tavg_cold-Tl_cool))))*1.039+((-0.000729*$C67+0.001448)*(Tl_cool-Tavg_cold)+(0.016908*$C67-0.033574))*1.039))))*Watts","v":0},{"$f":"ROUND(((H67/Watts)/((Tr_cool-Tv_cool)*1.163))*$I$14,IF($X$4=1,0,IF($X$4=2,2)))","v":0},{"$f":"($AA$66*(I67/$I$14)^$AA$68)*$J$14","v":{"$error":"#NUM!"}},{"$f":"L67-8","v":-8},0,0,{"$f":"AD67*Cubics","v":0},{"$f":"((($D67/Watts)/(((p_atm*0.028964)/(8.31447*(20+273.15)))*(($N67/3600)/Cubics)*(1005+1870*((0.622)/(((p_atm)/($E$12*Pvs_Heat_in))-1)))))+Tl_heat)*Celc1+Celc2","v":{"$error":"#DIV/0!"}},{"$f":"(Tl_cool-(($G67/Watts)/(1006*$N67*kgss)))*Celc1+Celc2","v":{"$error":"#DIV/0!"}},1,0,0,0,0.8831,0,{"$f":"(H67-G67)/H67","v":{"$error":"#DIV/0!"}},{"$f":"IF($X$16=1,AE67,IF($X$16=2,AL67,IF($X$16=3,BK67,IF($X$16=4,BD67,IF($X$16=5,BZ67,IF($X$16=6,BS67,IF($X$16=7,AW67,)))))))","v":0},0,0,0,0,0,0,null,null,null,null,null,null,null,null,null,null,null,null,null,null,null,null,null,null,null,null,null,null,null,null,null,5936.9099999999989,"b",1327.07,"b",43,14.8,481,8111.2999999999993,"b",1372.83,"b",43,14.8,481]
[null,0.8,8,{"$f":"(X68*($T$11^$Q68))*Watts*CF_Altit","v":0},{"$f":"ROUND(((D68/Watts)/(($S$9-$S$10)*1.163))*$E$14,IF($X$4=1,0,IF($X$4=2,2)))","v":0},{"$f":"($Y$66*(E68/$E$14)^$Y$68)*$F$14","v":{"$error":"#NUM!"}},{"$f":"(Z68*($W$11^R68))*Watts*CF_Altit","v":0},{"$f":"((G68/Watts)/(IF((237.3*LN((RH*EXP(17.27*(Tl_cool/(Tl_cool+237.3))))))/(17.27-LN((RH*EXP(17.27*(Tl_cool/(Tl_cool+237.3))))))<Tavg_cold,1,IF(1/(1+((2258*((0.622/(($Z$11/(1*611*EXP(17.27*(Tavg_cold/(Tavg_cold+237.3))))))-1)*1000-(0.622/(($Z$11/(RH*611*EXP(17.27*(Tl_cool/(Tl_cool+237.3))))))-1)*1000))/(1005*(Tavg_cold-Tl_cool))))*1.039+((-0.000729*$C68+0.001448)*(Tl_cool-Tavg_cold)+(0.016908*$C68-0.033574))*1.039>1,1,1/(1+((2258*((0.622/(($Z$11/(1*611*EXP(17.27*(Tavg_cold/(Tavg_cold+237.3))))))-1)*1000-(0.622/(($Z$11/(RH*611*EXP(17.27*(Tl_cool/(Tl_cool+237.3))))))-1)*1000))/(1005*(Tavg_cold-Tl_cool))))*1.039+((-0.000729*$C68+0.001448)*(Tl_cool-Tavg_cold)+(0.016908*$C68-0.033574))*1.039))))*Watts","v":0},{"$f":"ROUND(((H68/Watts)/((Tr_cool-Tv_cool)*1.163))*$I$14,IF($X$4=1,0,IF($X$4=2,2)))","v":0},{"$f":"($AA$66*(I68/$I$14)^$AA$68)*$J$14","v":{"$error":"#NUM!"}},{"$f":"L68-8","v":-8},0,0,{"$f":"AD68*Cubics","v":0},{"$f":"((($D68/Watts)/(((p_atm*0.028964)/(8.31447*(20+273.15)))*(($N68/3600)/Cubics)*(1005+1870*((0.622)/(((p_atm)/($E$12*Pvs_Heat_in))-1)))))+Tl_heat)*Celc1+Celc2","v":{"$error":"#DIV/0!"}},{"$f":"(Tl_cool-(($G68/Watts)/(1006*$N68*kgss)))*Celc1+Celc2","v":{"$error":"#DIV/0!"}},1,0,0,0,0.85389999999999999,0,{"$f":"(H68-G68)/H68","v":{"$error":"#DIV/0!"}},0,0,0,0,0,0,0,null,null,null,null,null,null,null,null,null,null,null,null,null,null,null,null,null,null,null,null,null,null,null,null,null,7294.0000000000009,1.8241099999999999,1720.18,1.8911334099329,50,26.2,638,10470.700000000001,1.81037,1764.1099999999997,{"$f":"BL68","v":1.81037},50,26.2,638]
[null,1,10,{"$f":"(X69*($T$11^$Q69))*Watts*CF_Altit","v":0},{"$f":"ROUND(((D69/Watts)/(($S$9-$S$10)*1.163))*$E$14,IF($X$4=1,0,IF($X$4=2,2)))","v":0},{"$f":"($Y$66*(E69/$E$14)^$Y$68)*$F$14","v":{"$error":"#NUM!"}},{"$f":"(Z69*($W$11^R69))*Watts*CF_Altit","v":0},{"$f":"((G69/Watts)/(IF((237.3*LN((RH*EXP(17.27*(Tl_cool/(Tl_cool+237.3))))))/(17.27-LN((RH*EXP(17.27*(Tl_cool/(Tl_cool+237.3))))))<Tavg_cold,1,IF(1/(1+((2258*((0.622/(($Z$11/(1*611*EXP(17.27*(Tavg_cold/(Tavg_cold+237.3))))))-1)*1000-(0.622/(($Z$11/(RH*611*EXP(17.27*(Tl_cool/(Tl_cool+237.3))))))-1)*1000))/(1005*(Tavg_cold-Tl_cool))))*1.039+((-0.000729*$C69+0.001448)*(Tl_cool-Tavg_cold)+(0.016908*$C69-0.033574))*1.039>1,1,1/(1+((2258*((0.622/(($Z$11/(1*611*EXP(17.27*(Tavg_cold/(Tavg_cold+237.3))))))-1)*1000-(0.622/(($Z$11/(RH*611*EXP(17.27*(Tl_cool/(Tl_cool+237.3))))))-1)*1000))/(1005*(Tavg_cold-Tl_cool))))*1.039+((-0.000729*$C69+0.001448)*(Tl_cool-Tavg_cold)+(0.016908*$C69-0.033574))*1.039))))*Watts","v":0},{"$f":"ROUND(((H69/Watts)/((Tr_cool-Tv_cool)*1.163))*$I$14,IF($X$4=1,0,IF($X$4=2,2)))","v":0},{"$f":"($AA$66*(I69/$I$14)^$AA$68)*$J$14","v":{"$error":"#NUM!"}},{"$f":"L69-8","v":-8},0,0,{"$f":"AD69*Cubics","v":0},{"$f":"((($D69/Watts)/(((p_atm*0.028964)/(8.31447*(20+273.15)))*(($N69/3600)/Cubics)*(1005+1870*((0.622)/(((p_atm)/($E$12*Pvs_Heat_in))-1)))))+Tl_heat)*Celc1+Celc2","v":{"$error":"#DIV/0!"}},{"$f":"(Tl_cool-(($G69/Watts)/(1006*$N69*kgss)))*Celc1+Celc2","v":{"$error":"#DIV/0!"}},1,0,0,0,0.77110000000000001,0,{"$f":"(H69-G69)/H69","v":{"$error":"#DIV/0!"}},0,0,0,0,0,0,0,null,null,null,null,null,null,null,null,null,null,null,null,null,null,null,null,null,null,null,null,null,null,null,null,null,8280,null,2102.4699999999998,null,53,38.799999999999997,748,12519.2,null,2135.09,null,53,38.799999999999997,748]
[null,{"$f":"IF($S$7=1,NL!A69,IF(cal!$S$7=2,EN!A69,IF(cal!$S$7=3,DE!A69,IF(cal!$S$7=4,FR!A69,IF(cal!$S$7=5,NR!A69,IF(cal!$S$7=6,SP!A69,IF(cal!$S$7=7,SW!A69,IF(cal!$S$7=8,TS!A69,IF(cal!$S$7=9,ExtraTaal1!A69,IF(cal!$S$7=10,ExtraTaal2!A69,IF(cal!$S$7=11,ExtraTaal3!A69,)))))))))))","v":"*La potencia de enfriamiento se calcula según la norma EN 16430 con ventiladores de todas las alturas."},null,null,null,null,null,null,null,null,null,null,null,{"$f":"'Clima Canal'!P71","v":"v2021-04-19"},null,null,null,null,null,null,null,null,null,0,0,0,0,0,0,0,null,null,null,null,null,null,null,null,null,null,null,null,null,null,null,null,null,null,null,null,null,null,null,null,null,"H",{"$f":"BE22","v":13},"B",{"$f":"BG22","v":32},"L",{"$f":"IF($X$4=1,300,300/2.54)","v":300},null,"H",{"$f":"BL22","v":13},"B",{"$f":"BN22","v":32},"L",{"$f":"IF($X$4=1,300,300/2.54)","v":300}]
[null,{"$f":"IF($S$7=1,NL!A70,IF(cal!$S$7=2,EN!A70,IF(cal!$S$7=3,DE!A70,IF(cal!$S$7=4,FR!A70,IF(cal!$S$7=5,NR!A70,IF(cal!$S$7=6,SP!A70,IF(cal!$S$7=7,SW!A70,IF(cal!$S$7=8,TS!A70,IF(cal!$S$7=9,ExtraTaal1!A70,IF(cal!$S$7=10,ExtraTaal2!A70,IF(cal!$S$7=11,ExtraTaal3!A70,)))))))))))","v":"**Potencia sonora según ISO 3741: 2010."}]
[null,{"$f":"IF($S$7=1,NL!A71,IF(cal!$S$7=2,EN!A71,IF(cal!$S$7=3,DE!A71,IF(cal!$S$7=4,FR!A71,IF(cal!$S$7=5,NR!A71,IF(cal!$S$7=6,SP!A71,IF(cal!$S$7=7,SW!A71,IF(cal!$S$7=8,TS!A71,IF(cal!$S$7=9,ExtraTaal1!A71,IF(cal!$S$7=10,ExtraTaal2!A71,IF(cal!$S$7=11,ExtraTaal3!A71,)))))))))))","v":"***Nivel de presión acústica con una amortiguación ambiental supuesta de 8 dB (A)."}]

{"sheet":"NL","index":2,"n_rows":71,"n_cols":18,"rows_kept":71,"cut":false,"hidden":true,"merged":[[50,0,50,12],[62,0,62,12],[7,0,7,2],[7,5,7,8],[8,0,8,2],[8,5,8,8],[9,0,9,2],[9,5,9,8],[26,0,26,12],[32,0,32,12],[38,0,38,12],[44,0,44,12],[56,0,56,12],[7,11,7,12],[5,11,5,12],[6,11,6,12],[10,5,10,7],[14,0,14,12],[20,0,20,12]]}
[]
["Invulformulier"]
[]
["Randvoorwaarden"]
[]
["Temperaturen",null,null,null,null,null,null,null,null,null,null,"Geplaatste hoogte"]
["Verwarmen:",null,null,null,null,"Koelen:",null,null,null,null,null,null,null,null,null,null,"Kopieer alle data"]
[{"$f":"\"Aanvoertemp.\"","v":"Aanvoertemp."},null,null,{"$f":"cal!E9","v":75},{"$f":"IF(cal!$X$4=1,\"°C\",IF(cal!$X$4=2,\"°F\"))","v":"°C"},{"$f":"A8","v":"Aanvoertemp."},null,null,null,{"$f":"cal!K9","v":16},{"$f":"E8","v":"°C"},"Eenheidsstelsel",null,null,null,null,"SI-eenheden"]
[{"$f":"\"Retourtemp.\"","v":"Retourtemp."},null,null,{"$f":"cal!E10","v":65},{"$f":"E8","v":"°C"},{"$f":"A9","v":"Retourtemp."},null,null,null,{"$f":"cal!K10","v":19},{"$f":"E8","v":"°C"},null,null,null,null,null,"Imperiale-eenheden"]
[{"$f":"\"Ruimtetemp.\"","v":"Ruimtetemp."},null,null,{"$f":"cal!E11","v":20},{"$f":"E8","v":"°C"},{"$f":"A10","v":"Ruimtetemp."},null,null,null,{"$f":"cal!K11","v":26},{"$f":"E8","v":"°C"}]
[null,null,null,null,null,"Relatieve vochtigheid",null,null,null,{"$f":"cal!K12","v":0.5}]
[]
[]
["Snelheidsniveau:","Stuurspanning: [V]",{"$f":"CONCATENATE(\"Warmteafgifte * \",ROUND(D8,0),\"/\",ROUND(D9,0),\"/\",ROUND(D10,0),\" [\"&IF(cal!$X$4=1,\"W\",IF(cal!$X$4=2,\"Btu/h\"))&\"]\")","v":"Warmteafgifte * 75/65/20 [W]"},{"$f":"\"Waterdebiet, verwarming [\"&IF(cal!$X$4=1,\"l/h\",IF(cal!$X$4=2,\"GPM\"))&\"]\"","v":"Waterdebiet, verwarming [l/h]"},{"$f":"\"Waterzijdig drukverlies [\"&IF(cal!$X$4=1,\"kPa\",IF(cal!$X$4=2,\"inH2O\"))&\"]\"","v":"Waterzijdig drukverlies [kPa]"},{"$f":"CONCATENATE(\"Voelb. Koelcapaciteit * \",ROUND(J8,0),\"/\",,ROUND(J9,0),\"/\",,ROUND(J10,0),\" [\"&IF(cal!$X$4=1,\"W\",IF(cal!$X$4=2,\"Btu/h\"))&\"]\")","v":"Voelb. Koelcapaciteit * 16/19/26 [W]"},{"$f":"CONCATENATE(\"Tot. koelcapaciteit \",,ROUND(J8,0),\"/\",,ROUND(J9,0),\"/\",,ROUND(J10,0),\" [\"&IF(cal!$X$4=1,\"W\",IF(cal!$X$4=2,\"Btu/h\"))&\"]\")","v":"Tot. koelcapaciteit 16/19/26 [W]"},{"$f":"\"Waterdebiet, koeling [\"&IF(cal!$X$4=1,\"l/h\",IF(cal!$X$4=2,\"GPM\"))&\"]\"","v":"Waterdebiet, koeling [l/h]"},{"$f":"\"Waterzijdig drukverlies [\"&IF(cal!$X$4=1,\"kPa\",IF(cal!$X$4=2,\"inH2O\"))&\"]\"","v":"Waterzijdig drukverlies [kPa]"},"Geluidsdruk *** [dB(A)]","Geluidsvermogen ** [dB(A)]","Opgenomen elektr. vermogen [W]",{"$f":"\"Luchtdebiet [\"&IF(cal!$X$4=1,\"m³/h\",IF(cal!$X$4=2,\"CFM\"))&\"]\"","v":"Luchtdebiet [m³/h]"},{"$f":"\"Uitblaastemp. verwarming [\"&IF(cal!$X$4=1,\"°C\",IF(cal!$X$4=2,\"°F\"))&\"]\"","v":"Uitblaastemp. verwarming [°C]"},{"$f":"\"Uitblaastemp. koeling [\"&IF(cal!$X$4=1,\"°C\",IF(cal!$X$4=2,\"°F\"))&\"]\"","v":"Uitblaastemp. koeling [°C]"}]
[{"$f":"cal!$Z$1&\" \"&$R$15&\" \"&ROUND(cal!Y22,1)&IF(cal!$X$4=1,\" cm\",IF(cal!$X$4=2,\" in\"))&\" \"&$R$16&\" \"&ROUND(cal!AA22,1)&IF(cal!$X$4=1,\" cm\",IF(cal!$X$4=2,\" in\"))&\" \"&$R$17&\" \"&ROUND(cal!AC22,1)&IF(cal!$X$4=1,\" cm\",IF(cal!$X$4=2,\" in\"))&\" (Type 1)\"","v":"Clima Canal hoogte 19 cm breedte 34 cm lengte 105 cm (Type 1)"},null,null,null,null,null,null,null,null,null,null,null,null,null,null,null,"Temp.","hoogte"]
[null,null,null,null,null,null,null,null,null,null,null,null,null,null,null,null,"verw.!","breedte"]
[null,null,null,null,null,null,null,null,null,null,null,null,null,null,null,null,"koelen!","lengte"]
[]
[]
[]
[{"$f":"cal!$Z$1&\" \"&$R$15&\" \"&ROUND(cal!Y28,1)&IF(cal!$X$4=1,\" cm\",IF(cal!$X$4=2,\" in\"))&\" \"&$R$16&\" \"&ROUND(cal!AA28,1)&IF(cal!$X$4=1,\" cm\",IF(cal!$X$4=2,\" in\"))&\" \"&$R$17&\" \"&ROUND(cal!AC28,1)&IF(cal!$X$4=1,\" cm\",IF(cal!$X$4=2,\" in\"))&\" (Type 2)\"","v":"Clima Canal hoogte 19 cm breedte 34 cm lengte 120 cm (Type 2)"}]
[]
[]
[]
[]
[]
[{"$f":"cal!$Z$1&\" \"&$R$15&\" \"&ROUND(cal!Y34,1)&IF(cal!$X$4=1,\" cm\",IF(cal!$X$4=2,\" in\"))&\" \"&$R$16&\" \"&ROUND(cal!AA34,1)&IF(cal!$X$4=1,\" cm\",IF(cal!$X$4=2,\" in\"))&\" \"&$R$17&\" \"&ROUND(cal!AC34,1)&IF(cal!$X$4=1,\" cm\",IF(cal!$X$4=2,\" in\"))&\" (Type 3)\"","v":"Clima Canal hoogte 19 cm breedte 34 cm lengte 200 cm (Type 3)"}]
[]
[]
[]
[]
[]
[{"$f":"cal!$Z$1&\" \"&$R$15&\" \"&ROUND(cal!Y40,1)&IF(cal!$X$4=1,\" cm\",IF(cal!$X$4=2,\" in\"))&\" \"&$R$16&\" \"&ROUND(cal!AA40,1)&IF(cal!$X$4=1,\" cm\",IF(cal!$X$4=2,\" in\"))&\" \"&$R$17&\" \"&ROUND(cal!AC40,1)&IF(cal!$X$4=1,\" cm\",IF(cal!$X$4=2,\" in\"))&\" (Type 4)\"","v":"Clima Canal hoogte 19 cm breedte 34 cm lengte 280 cm (Type 4)"}]
[]
[]
[]
[]
[]
[{"$f":"cal!$Z$1&\" \"&$R$15&\" \"&ROUND(cal!Y46,1)&IF(cal!$X$4=1,\" cm\",IF(cal!$X$4=2,\" in\"))&\" \"&$R$16&\" \"&ROUND(cal!AA46,1)&IF(cal!$X$4=1,\" cm\",IF(cal!$X$4=2,\" in\"))&\" \"&$R$17&\" \"&ROUND(cal!AC46,1)&IF(cal!$X$4=1,\" cm\",IF(cal!$X$4=2,\" in\"))&\" (Type 5)\"","v":"Clima Canal hoogte 0 cm breedte 0 cm lengte 0 cm (Type 5)"}]
[]
[]
[]
[]
[]
[{"$f":"cal!$Z$1&\" \"&$R$15&\" \"&ROUND(cal!Y52,1)&IF(cal!$X$4=1,\" cm\",IF(cal!$X$4=2,\" in\"))&\" \"&$R$16&\" \"&ROUND(cal!AA52,1)&IF(cal!$X$4=1,\" cm\",IF(cal!$X$4=2,\" in\"))&\" \"&$R$17&\" \"&ROUND(cal!AC52,1)&IF(cal!$X$4=1,\" cm\",IF(cal!$X$4=2,\" in\"))&\" (Type 6)\"","v":"Clima Canal hoogte 0 cm breedte 0 cm lengte 0 cm (Type 6)"}]
[]
[]
[]
[]
[]
[{"$f":"cal!$Z$1&\" \"&$R$15&\" \"&ROUND(cal!Y58,1)&IF(cal!$X$4=1,\" cm\",IF(cal!$X$4=2,\" in\"))&\" \"&$R$16&\" \"&ROUND(cal!AA58,1)&IF(cal!$X$4=1,\" cm\",IF(cal!$X$4=2,\" in\"))&\" \"&$R$17&\" \"&ROUND(cal!AC58,1)&IF(cal!$X$4=1,\" cm\",IF(cal!$X$4=2,\" in\"))&\" (Type 7)\"","v":"Clima Canal hoogte 0 cm breedte 0 cm lengte 0 cm (Type 7)"}]
[]
[]
[]
[]
[]
[{"$f":"cal!$Z$1&\" \"&$R$15&\" \"&ROUND(cal!Y64,1)&IF(cal!$X$4=1,\" cm\",IF(cal!$X$4=2,\" in\"))&\" \"&$R$16&\" \"&ROUND(cal!AA64,1)&IF(cal!$X$4=1,\" cm\",IF(cal!$X$4=2,\" in\"))&\" \"&$R$17&\" \"&ROUND(cal!AC64,1)&IF(cal!$X$4=1,\" cm\",IF(cal!$X$4=2,\" in\"))&\" (Type 8)\"","v":"Clima Canal hoogte 0 cm breedte 0 cm lengte 0 cm (Type 8)"}]
[]
[]
[]
[]
[]
[{"$f":"cal!$Z$1&\" \"&$R$15&\" \"&ROUND(cal!Y70,1)&IF(cal!$X$4=1,\" cm\",IF(cal!$X$4=2,\" in\"))&\" \"&$R$16&\" \"&ROUND(cal!AA70,1)&IF(cal!$X$4=1,\" cm\",IF(cal!$X$4=2,\" in\"))&\" \"&$R$17&\" \"&ROUND(cal!AC70,1)&IF(cal!$X$4=1,\" cm\",IF(cal!$X$4=2,\" in\"))&\" (Type 9)\"","v":"Clima Canal hoogte 0 cm breedte 0 cm lengte 0 cm (Type 9)"}]
[]
[]
[]
[]
[]
["*Waardes gemeten volgens EN 16430",null,null,null,null,null,null,null,null,null,null,null,{"$f":"cal!N70","v":"v2021-04-19"}]
["**Geluidsvermogen gemeten volgens ISO 3741:2010"]
["***Geluidsdruk bij een aangenomen ruimtedemping van 8 dB(A)"]

{"sheet":"EN","index":3,"n_rows":71,"n_cols":18,"rows_kept":71,"cut":false,"hidden":true,"merged":[[38,0,38,12],[44,0,44,12],[50,0,50,12],[62,0,62,12],[14,0,14,12],[20,0,20,12],[26,0,26,12],[32,0,32,12],[56,0,56,12],[7,11,7,12],[5,11,5,12],[6,11,6,12],[10,5,10,7],[7,0,7,2],[7,5,7,8],[8,0,8,2],[8,5,8,8],[9,0,9,2],[9,5,9,8]]}
[]
["Formulary"]
[]
["Conditions"]
[]
["Temperatures",null,null,null,null,null,null,null,null,null,null,"Altitude"]
["Heating:",null,null,null,null,"Cooling:",null,null,null,null,null,null,null,null,null,null,"Copy all data"]
[{"$f":"\"Inlet temp.\"","v":"Inlet temp."},null,null,{"$f":"cal!E9","v":75},{"$f":"IF(cal!$X$4=1,\"°C\",IF(cal!$X$4=2,\"°F\"))","v":"°C"},{"$f":"A8","v":"Inlet temp."},null,null,null,{"$f":"cal!K9","v":16},{"$f":"E8","v":"°C"},"Unit conversion",null,null,null,null,"SI-units"]
[{"$f":"\"Return temp.\"","v":"Return temp."},null,null,{"$f":"cal!E10","v":65},{"$f":"E8","v":"°C"},{"$f":"A9","v":"Return temp."},null,null,null,{"$f":"cal!K10","v":19},{"$f":"E8","v":"°C"},null,null,null,null,null,"Imperial-units"]
[{"$f":"\"Room temp.\"","v":"Room temp."},null,null,{"$f":"cal!E11","v":20},{"$f":"E8","v":"°C"},{"$f":"A10","v":"Room temp."},null,null,null,{"$f":"cal!K11","v":26},{"$f":"E8","v":"°C"}]
[null,null,null,null,null,"Relative humidity",null,null,null,{"$f":"cal!K12","v":0.5}]
[]
[]
["Speed level:","Control voltage [V]",{"$f":"CONCATENATE(\"Heat output * \",ROUND(D8,0),\"/\",ROUND(D9,0),\"/\",ROUND(D10,0),\" [\"&IF(cal!$X$4=1,\"W\",IF(cal!$X$4=2,\"Btu/h\"))&\"]\")","v":"Heat output * 75/65/20 [W]"},{"$f":"\"Water flowrate, heating [\"&IF(cal!$X$4=1,\"l/h\",IF(cal!$X$4=2,\"GPM\"))&\"]\"","v":"Water flowrate, heating [l/h]"},{"$f":"\"Watersided pressure loss [\"&IF(cal!$X$4=1,\"kPa\",IF(cal!$X$4=2,\"inH2O\"))&\"]\"","v":"Watersided pressure loss [kPa]"},{"$f":"CONCATENATE(\"Sens. cooling capacity * \",ROUND(J8,0),\"/\",ROUND(J9,0),\"/\",ROUND(J10,0),\" [\"&IF(cal!$X$4=1,\"W\",IF(cal!$X$4=2,\"Btu/h\"))&\"]\")","v":"Sens. cooling capacity * 16/19/26 [W]"},{"$f":"CONCATENATE(\"Tot. cooling capacity \",ROUND(J8,0),\"/\",ROUND(J9,0),\"/\",ROUND(J10,0),\" [\"&IF(cal!$X$4=1,\"W\",IF(cal!$X$4=2,\"Btu/h\"))&\"]\")","v":"Tot. cooling capacity 16/19/26 [W]"},{"$f":"\"Water flowrate, cooling [\"&IF(cal!$X$4=1,\"l/h\",IF(cal!$X$4=2,\"GPM\"))&\"]\"","v":"Water flowrate, cooling [l/h]"},{"$f":"\"Watersided pressure loss [\"&IF(cal!$X$4=1,\"kPa\",IF(cal!$X$4=2,\"inH2O\"))&\"]\"","v":"Watersided pressure loss [kPa]"},"Sound pressure *** [dB(A)]","Sound power ** [dB(A)]","Electrical power [W]",{"$f":"\"Air flowrate [\"&IF(cal!$X$4=1,\"m³/h\",IF(cal!$X$4=2,\"CFM\"))&\"]\"","v":"Air flowrate [m³/h]"},{"$f":"\"Air exhaust temp. heating [\"&IF(cal!$X$4=1,\"°C\",IF(cal!$X$4=2,\"°F\"))&\"]\"","v":"Air exhaust temp. heating [°C]"},{"$f":"\"Air exhaust temp. cooling [\"&IF(cal!$X$4=1,\"°C\",IF(cal!$X$4=2,\"°F\"))&\"]\"","v":"Air exhaust temp. cooling [°C]"}]
[{"$f":"cal!$Z$1&\" \"&$R$15&\" \"&ROUND(cal!Y22,1)&IF(cal!$X$4=1,\" cm\",IF(cal!$X$4=2,\" in\"))&\" \"&$R$16&\" \"&ROUND(cal!AA22,1)&IF(cal!$X$4=1,\" cm\",IF(cal!$X$4=2,\" in\"))&\" \"&$R$17&\" \"&ROUND(cal!AC22,1)&IF(cal!$X$4=1,\" cm\",IF(cal!$X$4=2,\" in\"))&\" (Type 1)\"","v":"Clima Canal height 19 cm width 34 cm length 105 cm (Type 1)"},null,null,null,null,null,null,null,null,null,null,null,null,null,null,null,"Temp.","height"]
[null,null,null,null,null,null,null,null,null,null,null,null,null,null,null,null,"heating!","width"]
[null,null,null,null,null,null,null,null,null,null,null,null,null,null,null,null,"cooling!","length"]
[]
[]
[]
[{"$f":"cal!$Z$1&\" \"&$R$15&\" \"&ROUND(cal!Y28,1)&IF(cal!$X$4=1,\" cm\",IF(cal!$X$4=2,\" in\"))&\" \"&$R$16&\" \"&ROUND(cal!AA28,1)&IF(cal!$X$4=1,\" cm\",IF(cal!$X$4=2,\" in\"))&\" \"&$R$17&\" \"&ROUND(cal!AC28,1)&IF(cal!$X$4=1,\" cm\",IF(cal!$X$4=2,\" in\"))&\" (Type 2)\"","v":"Clima Canal height 19 cm width 34 cm length 120 cm (Type 2)"}]
[]
[]
[]
[]
[]
[{"$f":"cal!$Z$1&\" \"&$R$15&\" \"&ROUND(cal!Y34,1)&IF(cal!$X$4=1,\" cm\",IF(cal!$X$4=2,\" in\"))&\" \"&$R$16&\" \"&ROUND(cal!AA34,1)&IF(cal!$X$4=1,\" cm\",IF(cal!$X$4=2,\" in\"))&\" \"&$R$17&\" \"&ROUND(cal!AC34,1)&IF(cal!$X$4=1,\" cm\",IF(cal!$X$4=2,\" in\"))&\" (Type 3)\"","v":"Clima Canal height 19 cm width 34 cm length 200 cm (Type 3)"}]
[]
[]
[]
[]
[]
[{"$f":"cal!$Z$1&\" \"&$R$15&\" \"&ROUND(cal!Y40,1)&IF(cal!$X$4=1,\" cm\",IF(cal!$X$4=2,\" in\"))&\" \"&$R$16&\" \"&ROUND(cal!AA40,1)&IF(cal!$X$4=1,\" cm\",IF(cal!$X$4=2,\" in\"))&\" \"&$R$17&\" \"&ROUND(cal!AC40,1)&IF(cal!$X$4=1,\" cm\",IF(cal!$X$4=2,\" in\"))&\" (Type 4)\"","v":"Clima Canal height 19 cm width 34 cm length 280 cm (Type 4)"}]
[]
[]
[]
[]
[]
[{"$f":"cal!$Z$1&\" \"&$R$15&\" \"&ROUND(cal!Y46,1)&IF(cal!$X$4=1,\" cm\",IF(cal!$X$4=2,\" in\"))&\" \"&$R$16&\" \"&ROUND(cal!AA46,1)&IF(cal!$X$4=1,\" cm\",IF(cal!$X$4=2,\" in\"))&\" \"&$R$17&\" \"&ROUND(cal!AC46,1)&IF(cal!$X$4=1,\" cm\",IF(cal!$X$4=2,\" in\"))&\" (Type 5)\"","v":"Clima Canal height 0 cm width 0 cm length 0 cm (Type 5)"}]
[]
[]
[]
[]
[]
[{"$f":"cal!$Z$1&\" \"&$R$15&\" \"&ROUND(cal!Y52,1)&IF(cal!$X$4=1,\" cm\",IF(cal!$X$4=2,\" in\"))&\" \"&$R$16&\" \"&ROUND(cal!AA52,1)&IF(cal!$X$4=1,\" cm\",IF(cal!$X$4=2,\" in\"))&\" \"&$R$17&\" \"&ROUND(cal!AC52,1)&IF(cal!$X$4=1,\" cm\",IF(cal!$X$4=2,\" in\"))&\" (Type 6)\"","v":"Clima Canal height 0 cm width 0 cm length 0 cm (Type 6)"}]
[]
[]
[]
[]
[]
[{"$f":"cal!$Z$1&\" \"&$R$15&\" \"&ROUND(cal!Y58,1)&IF(cal!$X$4=1,\" cm\",IF(cal!$X$4=2,\" in\"))&\" \"&$R$16&\" \"&ROUND(cal!AA58,1)&IF(cal!$X$4=1,\" cm\",IF(cal!$X$4=2,\" in\"))&\" \"&$R$17&\" \"&ROUND(cal!AC58,1)&IF(cal!$X$4=1,\" cm\",IF(cal!$X$4=2,\" in\"))&\" (Type 7)\"","v":"Clima Canal height 0 cm width 0 cm length 0 cm (Type 7)"}]
[]
[]
[]
[]
[]
[{"$f":"cal!$Z$1&\" \"&$R$15&\" \"&ROUND(cal!Y64,1)&IF(cal!$X$4=1,\" cm\",IF(cal!$X$4=2,\" in\"))&\" \"&$R$16&\" \"&ROUND(cal!AA64,1)&IF(cal!$X$4=1,\" cm\",IF(cal!$X$4=2,\" in\"))&\" \"&$R$17&\" \"&ROUND(cal!AC64,1)&IF(cal!$X$4=1,\" cm\",IF(cal!$X$4=2,\" in\"))&\" (Type 8)\"","v":"Clima Canal height 0 cm width 0 cm length 0 cm (Type 8)"}]
[]
[]
[]
[]
[]
[{"$f":"cal!$Z$1&\" \"&$R$15&\" \"&ROUND(cal!Y70,1)&IF(cal!$X$4=1,\" cm\",IF(cal!$X$4=2,\" in\"))&\" \"&$R$16&\" \"&ROUND(cal!AA70,1)&IF(cal!$X$4=1,\" cm\",IF(cal!$X$4=2,\" in\"))&\" \"&$R$17&\" \"&ROUND(cal!AC70,1)&IF(cal!$X$4=1,\" cm\",IF(cal!$X$4=2,\" in\"))&\" (Type 9)\"","v":"Clima Canal height 0 cm width 0 cm length 0 cm (Type 9)"}]
[]
[]
[]
[]
[]
["*Values according to EN 16430",null,null,null,null,null,null,null,null,null,null,null,{"$f":"cal!N70","v":"v2021-04-19"}]
["**Sound power according to ISO 3741:2010"]
["***Sound pressure with an assumed room damping of 8dB(A)"]

{"sheet":"DE","index":4,"n_rows":71,"n_cols":18,"rows_kept":71,"cut":false,"hidden":true,"merged":[[38,0,38,12],[44,0,44,12],[50,0,50,12],[62,0,62,12],[14,0,14,12],[20,0,20,12],[26,0,26,12],[32,0,32,12],[56,0,56,12],[7,11,7,12],[5,11,5,12],[6,11,6,12],[10,5,10,7],[7,0,7,2],[7,5,7,8],[8,0,8,2],[8,5,8,8],[9,0,9,2],[9,5,9,8]]}
[]
["Eingabefelder"]
[]
["Auslegungsrandbedingungen"]
[]
["Temperaturen",null,null,null,null,null,null,null,null,null,null,"Platzierte Höhe"]
["Heizen:",null,null,null,null,"Kühlen:",null,null,null,null,null,null,null,null,null,null,"Kopieren Sie alle daten"]
[{"$f":"\"Vorlauftemp.\"","v":"Vorlauftemp."},null,null,{"$f":"cal!E9","v":75},{"$f":"IF(cal!$X$4=1,\"°C\",IF(cal!$X$4=2,\"°F\"))","v":"°C"},{"$f":"A8","v":"Vorlauftemp."},null,null,null,{"$f":"cal!K9","v":16},{"$f":"E8","v":"°C"},"Einheiten",null,null,null,null,"SI-einheiten"]
[{"$f":"\"Rücklauftemp.\"","v":"Rücklauftemp."},null,null,{"$f":"cal!E10","v":65},{"$f":"E8","v":"°C"},{"$f":"A9","v":"Rücklauftemp."},null,null,null,{"$f":"cal!K10","v":19},{"$f":"E8","v":"°C"},null,null,null,null,null,"Imperiale-einheiten"]
[{"$f":"\"Raumtemp.\"","v":"Raumtemp."},null,null,{"$f":"cal!E11","v":20},{"$f":"E8","v":"°C"},{"$f":"A10","v":"Raumtemp."},null,null,null,{"$f":"cal!K11","v":26},{"$f":"E8","v":"°C"}]
[null,null,null,null,null,"Relative Luftfeuchtigkeit",null,null,null,{"$f":"cal!K12","v":0.5}]
[]
[]
["Drehzahlstufe:","Regelspannung: [V]",{"$f":"CONCATENATE(\"Wärmeleistung * \",ROUND(D8,0),\"/\",ROUND(D9,0),\"/\",ROUND(D10,0),\" [\"&IF(cal!$X$4=1,\"W\",IF(cal!$X$4=2,\"Btu/h\"))&\"]\")","v":"Wärmeleistung * 75/65/20 [W]"},{"$f":"\"Heizmittelstrom [\"&IF(cal!$X$4=1,\"l/h\",IF(cal!$X$4=2,\"GPM\"))&\"]\"","v":"Heizmittelstrom [l/h]"},{"$f":"\"zug. wassers. Druckverlust [\"&IF(cal!$X$4=1,\"kPa\",IF(cal!$X$4=2,\"inH2O\"))&\"]\"","v":"zug. wassers. Druckverlust [kPa]"},{"$f":"CONCATENATE(\"Sens. Kälteleistung * \",ROUND(J8,0),\"/\",ROUND(J9,0),\"/\",ROUND(J10,0),\" [\"&IF(cal!$X$4=1,\"W\",IF(cal!$X$4=2,\"Btu/h\"))&\"]\")","v":"Sens. Kälteleistung * 16/19/26 [W]"},{"$f":"CONCATENATE(\"Tot. Kälteleistung \",ROUND(J8,0),\"/\",ROUND(J9,0),\"/\",ROUND(J10,0),\" [\"&IF(cal!$X$4=1,\"W\",IF(cal!$X$4=2,\"Btu/h\"))&\"]\")","v":"Tot. Kälteleistung 16/19/26 [W]"},{"$f":"\"Kühlmittelstrom [\"&IF(cal!$X$4=1,\"l/h\",IF(cal!$X$4=2,\"GPM\"))&\"]\"","v":"Kühlmittelstrom [l/h]"},{"$f":"\"zug. wassers. Druckverlust [\"&IF(cal!$X$4=1,\"kPa\",IF(cal!$X$4=2,\"inH2O\"))&\"]\"","v":"zug. wassers. Druckverlust [kPa]"},"Schalldruckpegel *** [dB(A)]","Schallleistungspegel ** [dB(A)]","Leistungsaufnahme [W]",{"$f":"\"Luftvolumenstrom [\"&IF(cal!$X$4=1,\"m³/h\",IF(cal!$X$4=2,\"CFM\"))&\"]\"","v":"Luftvolumenstrom [m³/h]"},{"$f":"\"Luftaustrittstemp. Heizung [\"&IF(cal!$X$4=1,\"°C\",IF(cal!$X$4=2,\"°F\"))&\"]\"","v":"Luftaustrittstemp. Heizung [°C]"},{"$f":"\"Luftaustrittstemp. kühlung [\"&IF(cal!$X$4=1,\"°C\",IF(cal!$X$4=2,\"°F\"))&\"]\"","v":"Luftaustrittstemp. kühlung [°C]"}]
[{"$f":"cal!$Z$1&\" \"&$R$15&\" \"&ROUND(cal!Y22,1)&IF(cal!$X$4=1,\" cm\",IF(cal!$X$4=2,\" in\"))&\" \"&$R$16&\" \"&ROUND(cal!AA22,1)&IF(cal!$X$4=1,\" cm\",IF(cal!$X$4=2,\" in\"))&\" \"&$R$17&\" \"&ROUND(cal!AC22,1)&IF(cal!$X$4=1,\" cm\",IF(cal!$X$4=2,\" in\"))&\" (Type 1)\"","v":"Clima Canal höhe 19 cm breite 34 cm länge 105 cm (Type 1)"},null,null,null,null,null,null,null,null,null,null,null,null,null,null,null,"Temp.","höhe"]
[null,null,null,null,null,null,null,null,null,null,null,null,null,null,null,null,"heizen!","breite"]
[null,null,null,null,null,null,null,null,null,null,null,null,null,null,null,null,"kühlen!","länge"]
[]
[]
[]
[{"$f":"cal!$Z$1&\" \"&$R$15&\" \"&ROUND(cal!Y28,1)&IF(cal!$X$4=1,\" cm\",IF(cal!$X$4=2,\" in\"))&\" \"&$R$16&\" \"&ROUND(cal!AA28,1)&IF(cal!$X$4=1,\" cm\",IF(cal!$X$4=2,\" in\"))&\" \"&$R$17&\" \"&ROUND(cal!AC28,1)&IF(cal!$X$4=1,\" cm\",IF(cal!$X$4=2,\" in\"))&\" (Type 2)\"","v":"Clima Canal höhe 19 cm breite 34 cm länge 120 cm (Type 2)"}]
[]
[]
[]
[]
[]
[{"$f":"cal!$Z$1&\" \"&$R$15&\" \"&ROUND(cal!Y34,1)&IF(cal!$X$4=1,\" cm\",IF(cal!$X$4=2,\" in\"))&\" \"&$R$16&\" \"&ROUND(cal!AA34,1)&IF(cal!$X$4=1,\" cm\",IF(cal!$X$4=2,\" in\"))&\" \"&$R$17&\" \"&ROUND(cal!AC34,1)&IF(cal!$X$4=1,\" cm\",IF(cal!$X$4=2,\" in\"))&\" (Type 3)\"","v":"Clima Canal höhe 19 cm breite 34 cm länge 200 cm (Type 3)"}]
[]
[]
[]
[]
[]
[{"$f":"cal!$Z$1&\" \"&$R$15&\" \"&ROUND(cal!Y40,1)&IF(cal!$X$4=1,\" cm\",IF(cal!$X$4=2,\" in\"))&\" \"&$R$16&\" \"&ROUND(cal!AA40,1)&IF(cal!$X$4=1,\" cm\",IF(cal!$X$4=2,\" in\"))&\" \"&$R$17&\" \"&ROUND(cal!AC40,1)&IF(cal!$X$4=1,\" cm\",IF(cal!$X$4=2,\" in\"))&\" (Type 4)\"","v":"Clima Canal höhe 19 cm breite 34 cm länge 280 cm (Type 4)"}]
[]
[]
[]
[]
[]
[{"$f":"cal!$Z$1&\" \"&$R$15&\" \"&ROUND(cal!Y46,1)&IF(cal!$X$4=1,\" cm\",IF(cal!$X$4=2,\" in\"))&\" \"&$R$16&\" \"&ROUND(cal!AA46,1)&IF(cal!$X$4=1,\" cm\",IF(cal!$X$4=2,\" in\"))&\" \"&$R$17&\" \"&ROUND(cal!AC46,1)&IF(cal!$X$4=1,\" cm\",IF(cal!$X$4=2,\" in\"))&\" (Type 5)\"","v":"Clima Canal höhe 0 cm breite 0 cm länge 0 cm (Type 5)"}]
[]
[]
[]
[]
[]
[{"$f":"cal!$Z$1&\" \"&$R$15&\" \"&ROUND(cal!Y52,1)&IF(cal!$X$4=1,\" cm\",IF(cal!$X$4=2,\" in\"))&\" \"&$R$16&\" \"&ROUND(cal!AA52,1)&IF(cal!$X$4=1,\" cm\",IF(cal!$X$4=2,\" in\"))&\" \"&$R$17&\" \"&ROUND(cal!AC52,1)&IF(cal!$X$4=1,\" cm\",IF(cal!$X$4=2,\" in\"))&\" (Type 6)\"","v":"Clima Canal höhe 0 cm breite 0 cm länge 0 cm (Type 6)"}]
[]
[]
[]
[]
[]
[{"$f":"cal!$Z$1&\" \"&$R$15&\" \"&ROUND(cal!Y58,1)&IF(cal!$X$4=1,\" cm\",IF(cal!$X$4=2,\" in\"))&\" \"&$R$16&\" \"&ROUND(cal!AA58,1)&IF(cal!$X$4=1,\" cm\",IF(cal!$X$4=2,\" in\"))&\" \"&$R$17&\" \"&ROUND(cal!AC58,1)&IF(cal!$X$4=1,\" cm\",IF(cal!$X$4=2,\" in\"))&\" (Type 7)\"","v":"Clima Canal höhe 0 cm breite 0 cm länge 0 cm (Type 7)"}]
[]
[]
[]
[]
[]
[{"$f":"cal!$Z$1&\" \"&$R$15&\" \"&ROUND(cal!Y64,1)&IF(cal!$X$4=1,\" cm\",IF(cal!$X$4=2,\" in\"))&\" \"&$R$16&\" \"&ROUND(cal!AA64,1)&IF(cal!$X$4=1,\" cm\",IF(cal!$X$4=2,\" in\"))&\" \"&$R$17&\" \"&ROUND(cal!AC64,1)&IF(cal!$X$4=1,\" cm\",IF(cal!$X$4=2,\" in\"))&\" (Type 8)\"","v":"Clima Canal höhe 0 cm breite 0 cm länge 0 cm (Type 8)"}]
[]
[]
[]
[]
[]
[{"$f":"cal!$Z$1&\" \"&$R$15&\" \"&ROUND(cal!Y70,1)&IF(cal!$X$4=1,\" cm\",IF(cal!$X$4=2,\" in\"))&\" \"&$R$16&\" \"&ROUND(cal!AA70,1)&IF(cal!$X$4=1,\" cm\",IF(cal!$X$4=2,\" in\"))&\" \"&$R$17&\" \"&ROUND(cal!AC70,1)&IF(cal!$X$4=1,\" cm\",IF(cal!$X$4=2,\" in\"))&\" (Type 9)\"","v":"Clima Canal höhe 0 cm breite 0 cm länge 0 cm (Type 9)"}]
[]
[]
[]
[]
[]
["*Leistungsangaben nach EN 16430",null,null,null,null,null,null,null,null,null,null,null,{"$f":"cal!N70","v":"v2021-04-19"}]
["**Schallleistungspegel nach ISO 3741:2010"]
["***Schalldruckpegel bei angenommener Raumdämpfung von 8dB(A)"]

{"sheet":"FR","index":5,"n_rows":71,"n_cols":18,"rows_kept":71,"cut":false,"hidden":true,"merged":[[38,0,38,12],[44,0,44,12],[50,0,50,12],[62,0,62,12],[14,0,14,12],[20,0,20,12],[26,0,26,12],[32,0,32,12],[56,0,56,12],[7,11,7,12],[5,11,5,12],[6,11,6,12],[10,5,10,7],[7,0,7,2],[7,5,7,8],[8,0,8,2],[8,5,8,8],[9,0,9,2],[9,5,9,8]]}
[]
["Formulaire"]
[]
["Conditions"]
[]
["Températures",null,null,null,null,null,null,null,null,null,null,"Hauteur placée"]
["Chauffer:",null,null,null,null,"Refroidir:",null,null,null,null,null,null,null,null,null,null,"Copier toutes des données"]
[{"$f":"\"Temp. entrée\"","v":"Temp. entrée"},null,null,{"$f":"cal!E9","v":75},{"$f":"IF(cal!$X$4=1,\"°C\",IF(cal!$X$4=2,\"°F\"))","v":"°C"},{"$f":"A8","v":"Temp. entrée"},null,null,null,{"$f":"cal!K9","v":16},{"$f":"E8","v":"°C"},"Système unitaire",null,null,null,null,"Unités-SI"]
[{"$f":"\"Temp. retour\"","v":"Temp. retour"},null,null,{"$f":"cal!E10","v":65},{"$f":"E8","v":"°C"},{"$f":"A9","v":"Temp. retour"},null,null,null,{"$f":"cal!K10","v":19},{"$f":"E8","v":"°C"},null,null,null,null,null,"Unités-Impériales"]
[{"$f":"\"Temp. ambiante\"","v":"Temp. ambiante"},null,null,{"$f":"cal!E11","v":20},{"$f":"E8","v":"°C"},{"$f":"A10","v":"Temp. ambiante"},null,null,null,{"$f":"cal!K11","v":26},{"$f":"E8","v":"°C"}]
[null,null,null,null,null,"Humidité relative",null,null,null,{"$f":"cal!K12","v":0.5}]
[]
[]
["Niveau de vitesse","Voltage [V]",{"$f":"CONCATENATE(\"Puissance de cha. * \",ROUND(D8,0),\"/\",ROUND(D9,0),\"/\",ROUND(D10,0),\" [\"&IF(cal!$X$4=1,\"W\",IF(cal!$X$4=2,\"Btu/h\"))&\"]\")","v":"Puissance de cha. * 75/65/20 [W]"},{"$f":"\"Débit d'eau, chauffer [\"&IF(cal!$X$4=1,\"l/h\",IF(cal!$X$4=2,\"GPM\"))&\"]\"","v":"Débit d'eau, chauffer [l/h]"},{"$f":"\"Perte de charge [\"&IF(cal!$X$4=1,\"kPa\",IF(cal!$X$4=2,\"inH2O\"))&\"]\"","v":"Perte de charge [kPa]"},{"$f":"CONCATENATE(\"Puissance sens. de refr. * \",ROUND(J8,0),\"/\",ROUND(J9,0),\"/\",ROUND(J10,0),\" [\"&IF(cal!$X$4=1,\"W\",IF(cal!$X$4=2,\"Btu/h\"))&\"]\")","v":"Puissance sens. de refr. * 16/19/26 [W]"},{"$f":"CONCATENATE(\"Puissance tot. de refr. \",ROUND(J8,0),\"/\",ROUND(J9,0),\"/\",ROUND(J10,0),\" [\"&IF(cal!$X$4=1,\"W\",IF(cal!$X$4=2,\"Btu/h\"))&\"]\")","v":"Puissance tot. de refr. 16/19/26 [W]"},{"$f":"\"Débit d'eau, refroidir [\"&IF(cal!$X$4=1,\"l/h\",IF(cal!$X$4=2,\"GPM\"))&\"]\"","v":"Débit d'eau, refroidir [l/h]"},{"$f":"\"Perte de charge [\"&IF(cal!$X$4=1,\"kPa\",IF(cal!$X$4=2,\"inH2O\"))&\"]\"","v":"Perte de charge [kPa]"},"Pression sonore *** [dB(A)]","Puissance sonore ** [dB(A)]","Puissance absorbée [W]",{"$f":"\"Débit d'air [\"&IF(cal!$X$4=1,\"m³/h\",IF(cal!$X$4=2,\"CFM\"))&\"]\"","v":"Débit d'air [m³/h]"},{"$f":"\"Temp. de la sortie d'air cha. [\"&IF(cal!$X$4=1,\"°C\",IF(cal!$X$4=2,\"°F\"))&\"]\"","v":"Temp. de la sortie d'air cha. [°C]"},{"$f":"\"Temp. de la sortie d'air refr. [\"&IF(cal!$X$4=1,\"°C\",IF(cal!$X$4=2,\"°F\"))&\"]\"","v":"Temp. de la sortie d'air refr. [°C]"}]
[{"$f":"cal!$Z$1&\" \"&$R$15&\" \"&ROUND(cal!Y22,1)&IF(cal!$X$4=1,\" cm\",IF(cal!$X$4=2,\" in\"))&\" \"&$R$16&\" \"&ROUND(cal!AA22,1)&IF(cal!$X$4=1,\" cm\",IF(cal!$X$4=2,\" in\"))&\" \"&$R$17&\" \"&ROUND(cal!AC22,1)&IF(cal!$X$4=1,\" cm\",IF(cal!$X$4=2,\" in\"))&\" (Type 1)\"","v":"Clima Canal hauteur 19 cm largeur 34 cm longueur 105 cm (Type 1)"},null,null,null,null,null,null,null,null,null,null,null,null,null,null,null,"Temp.","hauteur"]
[null,null,null,null,null,null,null,null,null,null,null,null,null,null,null,null,"chauf.!","largeur"]
[null,null,null,null,null,null,null,null,null,null,null,null,null,null,null,null,"refr.!","longueur"]
[]
[]
[]
[{"$f":"cal!$Z$1&\" \"&$R$15&\" \"&ROUND(cal!Y28,1)&IF(cal!$X$4=1,\" cm\",IF(cal!$X$4=2,\" in\"))&\" \"&$R$16&\" \"&ROUND(cal!AA28,1)&IF(cal!$X$4=1,\" cm\",IF(cal!$X$4=2,\" in\"))&\" \"&$R$17&\" \"&ROUND(cal!AC28,1)&IF(cal!$X$4=1,\" cm\",IF(cal!$X$4=2,\" in\"))&\" (Type 2)\"","v":"Clima Canal hauteur 19 cm largeur 34 cm longueur 120 cm (Type 2)"}]
[]
[]
[]
[]
[]
[{"$f":"cal!$Z$1&\" \"&$R$15&\" \"&ROUND(cal!Y34,1)&IF(cal!$X$4=1,\" cm\",IF(cal!$X$4=2,\" in\"))&\" \"&$R$16&\" \"&ROUND(cal!AA34,1)&IF(cal!$X$4=1,\" cm\",IF(cal!$X$4=2,\" in\"))&\" \"&$R$17&\" \"&ROUND(cal!AC34,1)&IF(cal!$X$4=1,\" cm\",IF(cal!$X$4=2,\" in\"))&\" (Type 3)\"","v":"Clima Canal hauteur 19 cm largeur 34 cm longueur 200 cm (Type 3)"}]
[]
[]
[]
[]
[]
[{"$f":"cal!$Z$1&\" \"&$R$15&\" \"&ROUND(cal!Y40,1)&IF(cal!$X$4=1,\" cm\",IF(cal!$X$4=2,\" in\"))&\" \"&$R$16&\" \"&ROUND(cal!AA40,1)&IF(cal!$X$4=1,\" cm\",IF(cal!$X$4=2,\" in\"))&\" \"&$R$17&\" \"&ROUND(cal!AC40,1)&IF(cal!$X$4=1,\" cm\",IF(cal!$X$4=2,\" in\"))&\" (Type 4)\"","v":"Clima Canal hauteur 19 cm largeur 34 cm longueur 280 cm (Type 4)"}]
[]
[]
[]
[]
[]
[{"$f":"cal!$Z$1&\" \"&$R$15&\" \"&ROUND(cal!Y46,1)&IF(cal!$X$4=1,\" cm\",IF(cal!$X$4=2,\" in\"))&\" \"&$R$16&\" \"&ROUND(cal!AA46,1)&IF(cal!$X$4=1,\" cm\",IF(cal!$X$4=2,\" in\"))&\" \"&$R$17&\" \"&ROUND(cal!AC46,1)&IF(cal!$X$4=1,\" cm\",IF(cal!$X$4=2,\" in\"))&\" (Type 5)\"","v":"Clima Canal hauteur 0 cm largeur 0 cm longueur 0 cm (Type 5)"}]
[]
[]
[]
[]
[]
[{"$f":"cal!$Z$1&\" \"&$R$15&\" \"&ROUND(cal!Y52,1)&IF(cal!$X$4=1,\" cm\",IF(cal!$X$4=2,\" in\"))&\" \"&$R$16&\" \"&ROUND(cal!AA52,1)&IF(cal!$X$4=1,\" cm\",IF(cal!$X$4=2,\" in\"))&\" \"&$R$17&\" \"&ROUND(cal!AC52,1)&IF(cal!$X$4=1,\" cm\",IF(cal!$X$4=2,\" in\"))&\" (Type 6)\"","v":"Clima Canal hauteur 0 cm largeur 0 cm longueur 0 cm (Type 6)"}]
[]
[]
[]
[]
[]
[{"$f":"cal!$Z$1&\" \"&$R$15&\" \"&ROUND(cal!Y58,1)&IF(cal!$X$4=1,\" cm\",IF(cal!$X$4=2,\" in\"))&\" \"&$R$16&\" \"&ROUND(cal!AA58,1)&IF(cal!$X$4=1,\" cm\",IF(cal!$X$4=2,\" in\"))&\" \"&$R$17&\" \"&ROUND(cal!AC58,1)&IF(cal!$X$4=1,\" cm\",IF(cal!$X$4=2,\" in\"))&\" (Type 7)\"","v":"Clima Canal hauteur 0 cm largeur 0 cm longueur 0 cm (Type 7)"}]
[]
[]
[]
[]
[]
[{"$f":"cal!$Z$1&\" \"&$R$15&\" \"&ROUND(cal!Y64,1)&IF(cal!$X$4=1,\" cm\",IF(cal!$X$4=2,\" in\"))&\" \"&$R$16&\" \"&ROUND(cal!AA64,1)&IF(cal!$X$4=1,\" cm\",IF(cal!$X$4=2,\" in\"))&\" \"&$R$17&\" \"&ROUND(cal!AC64,1)&IF(cal!$X$4=1,\" cm\",IF(cal!$X$4=2,\" in\"))&\" (Type 8)\"","v":"Clima Canal hauteur 0 cm largeur 0 cm longueur 0 cm (Type 8)"}]
[]
[]
[]
[]
[]
[{"$f":"cal!$Z$1&\" \"&$R$15&\" \"&ROUND(cal!Y70,1)&IF(cal!$X$4=1,\" cm\",IF(cal!$X$4=2,\" in\"))&\" \"&$R$16&\" \"&ROUND(cal!AA70,1)&IF(cal!$X$4=1,\" cm\",IF(cal!$X$4=2,\" in\"))&\" \"&$R$17&\" \"&ROUND(cal!AC70,1)&IF(cal!$X$4=1,\" cm\",IF(cal!$X$4=2,\" in\"))&\" (Type 9)\"","v":"Clima Canal hauteur 0 cm largeur 0 cm longueur 0 cm (Type 9)"}]
[]
[]
[]
[]
[]
["*Testé selon EN 16430",null,null,null,null,null,null,null,null,null,null,null,{"$f":"cal!N70","v":"v2021-04-19"}]
["**Puissance sonore testé selon ISO 3741:2010"]
["***Pression sonore avec une atténuation ambiante du 8dB(A)"]

{"sheet":"NR","index":6,"n_rows":71,"n_cols":18,"rows_kept":71,"cut":false,"hidden":true,"merged":[[50,0,50,12],[56,0,56,12],[62,0,62,12],[2,6,2,9],[3,6,3,9],[14,0,14,12],[20,0,20,12],[26,0,26,12],[32,0,32,12],[38,0,38,12],[44,0,44,12],[7,0,7,2],[7,5,7,8],[8,0,8,2],[8,5,8,8],[9,0,9,2],[7,11,7,12],[5,11,5,12],[6,11,6,12],[10,5,10,7],[9,5,9,8]]}
[]
["Modell"]
[]
["Conditions"]
[]
["Temperaturer",null,null,null,null,null,null,null,null,null,null,"Plassert høyde"]
["Varme:",null,null,null,null,"Kjøling:",null,null,null,null,null,null,null,null,null,null,"Kopier alle data"]
["Tur vanntemp.",0,0,{"$f":"cal!E9","v":75},{"$f":"IF(cal!$X$4=1,\"°C\",IF(cal!$X$4=2,\"°F\"))","v":"°C"},{"$f":"A8","v":"Tur vanntemp."},null,null,null,{"$f":"cal!K9","v":16},{"$f":"E8","v":"°C"},"Enhetssystem",null,null,null,null,"SI-enheter"]
["Retur vanntemp.",0,0,{"$f":"cal!E10","v":65},{"$f":"E8","v":"°C"},{"$f":"A9","v":"Retur vanntemp."},null,null,null,{"$f":"cal!K10","v":19},{"$f":"E8","v":"°C"},null,null,null,null,null,"Imperiale-enheter"]
["Rom temp.",0,0,{"$f":"cal!E11","v":20},{"$f":"E8","v":"°C"},{"$f":"A10","v":"Rom temp."},null,null,null,{"$f":"cal!K11","v":26},{"$f":"E8","v":"°C"}]
[null,null,null,null,null,"Relativ fuktighet",null,null,null,{"$f":"cal!K12","v":0.5}]
[]
[]
["Hastighet:","Styresignal[V]",{"$f":"CONCATENATE(\"Varme effekt * \",ROUND(D8,0),\"/\",ROUND(D9,0),\"/\",ROUND(D10,0),\" [\"&IF(cal!$X$4=1,\"W\",IF(cal!$X$4=2,\"Btu/h\"))&\"]\")","v":"Varme effekt * 75/65/20 [W]"},{"$f":"\"Vannmengde, varme [\"&IF(cal!$X$4=1,\"l/h\",IF(cal!$X$4=2,\"GPM\"))&\"]\"","v":"Vannmengde, varme [l/h]"},{"$f":"\"Trykktap [\"&IF(cal!$X$4=1,\"kPa\",IF(cal!$X$4=2,\"ftH2O\"))&\"]\"","v":"Trykktap [kPa]"},{"$f":"CONCATENATE(\"Sens. Kjøling effekt * \",ROUND(J8,0),\"/\",ROUND(J9,0),\"/\",ROUND(J10,0),\" [\"&IF(cal!$X$4=1,\"W\",IF(cal!$X$4=2,\"Btu/h\"))&\"]\")","v":"Sens. Kjøling effekt * 16/19/26 [W]"},{"$f":"CONCATENATE(\"Tot. Kjøle effekt * \",ROUND(J8,0),\"/\",ROUND(J9,0),\"/\",ROUND(J10,0),\" [\"&IF(cal!$X$4=1,\"W\",IF(cal!$X$4=2,\"Btu/h\"))&\"]\")","v":"Tot. Kjøle effekt * 16/19/26 [W]"},{"$f":"\"Vannmengde, kjøling [\"&IF(cal!$X$4=1,\"l/h\",IF(cal!$X$4=2,\"GPM\"))&\"]\"","v":"Vannmengde, kjøling [l/h]"},{"$f":"E14","v":"Trykktap [kPa]"},"Lydtrykk *** [dB(A)]","Lydeffekt ** [dB(A)]","Elektrisk effekt [W]",{"$f":"\"Luftmengde [\"&IF(cal!$X$4=1,\"m³/h\",IF(cal!$X$4=2,\"CFM\"))&\"]\"","v":"Luftmengde [m³/h]"},{"$f":"\"Utluft temperatur, Varme [\"&IF(cal!$X$4=1,\"°C\",IF(cal!$X$4=2,\"°F\"))&\"]\"","v":"Utluft temperatur, Varme [°C]"},{"$f":"\"Utluft temperatur, Kjøling [\"&IF(cal!$X$4=1,\"°C\",IF(cal!$X$4=2,\"°F\"))&\"]\"","v":"Utluft temperatur, Kjøling [°C]"}]
[{"$f":"cal!$Z$1&\" \"&$R$15&\" \"&ROUND(cal!Y22,1)&IF(cal!$X$4=1,\" cm\",IF(cal!$X$4=2,\" in\"))&\" \"&$R$16&\" \"&ROUND(cal!AA22,1)&IF(cal!$X$4=1,\" cm\",IF(cal!$X$4=2,\" in\"))&\" \"&$R$17&\" \"&ROUND(cal!AC22,1)&IF(cal!$X$4=1,\" cm\",IF(cal!$X$4=2,\" in\"))&\" (Type 1)\"","v":"Clima Canal høyde 19 cm bredde 34 cm lengde 105 cm (Type 1)"},null,null,null,null,null,null,null,null,null,null,null,null,null,null,null,"Temp.","høyde"]
[null,null,null,null,null,null,null,null,null,null,null,null,null,null,null,null,"varme!","bredde"]
[null,null,null,null,null,null,null,null,null,null,null,null,null,null,null,null,"kjøling!","lengde"]
[]
[]
[]
[{"$f":"cal!$Z$1&\" \"&$R$15&\" \"&ROUND(cal!Y28,1)&IF(cal!$X$4=1,\" cm\",IF(cal!$X$4=2,\" in\"))&\" \"&$R$16&\" \"&ROUND(cal!AA28,1)&IF(cal!$X$4=1,\" cm\",IF(cal!$X$4=2,\" in\"))&\" \"&$R$17&\" \"&ROUND(cal!AC28,1)&IF(cal!$X$4=1,\" cm\",IF(cal!$X$4=2,\" in\"))&\" (Type 2)\"","v":"Clima Canal høyde 19 cm bredde 34 cm lengde 120 cm (Type 2)"}]
[]
[]
[]
[]
[]
[{"$f":"cal!$Z$1&\" \"&$R$15&\" \"&ROUND(cal!Y34,1)&IF(cal!$X$4=1,\" cm\",IF(cal!$X$4=2,\" in\"))&\" \"&$R$16&\" \"&ROUND(cal!AA34,1)&IF(cal!$X$4=1,\" cm\",IF(cal!$X$4=2,\" in\"))&\" \"&$R$17&\" \"&ROUND(cal!AC34,1)&IF(cal!$X$4=1,\" cm\",IF(cal!$X$4=2,\" in\"))&\" (Type 3)\"","v":"Clima Canal høyde 19 cm bredde 34 cm lengde 200 cm (Type 3)"}]
[]
[]
[]
[]
[]
[{"$f":"cal!$Z$1&\" \"&$R$15&\" \"&ROUND(cal!Y40,1)&IF(cal!$X$4=1,\" cm\",IF(cal!$X$4=2,\" in\"))&\" \"&$R$16&\" \"&ROUND(cal!AA40,1)&IF(cal!$X$4=1,\" cm\",IF(cal!$X$4=2,\" in\"))&\" \"&$R$17&\" \"&ROUND(cal!AC40,1)&IF(cal!$X$4=1,\" cm\",IF(cal!$X$4=2,\" in\"))&\" (Type 4)\"","v":"Clima Canal høyde 19 cm bredde 34 cm lengde 280 cm (Type 4)"}]
[]
[]
[]
[]
[]
[{"$f":"cal!$Z$1&\" \"&$R$15&\" \"&ROUND(cal!Y46,1)&IF(cal!$X$4=1,\" cm\",IF(cal!$X$4=2,\" in\"))&\" \"&$R$16&\" \"&ROUND(cal!AA46,1)&IF(cal!$X$4=1,\" cm\",IF(cal!$X$4=2,\" in\"))&\" \"&$R$17&\" \"&ROUND(cal!AC46,1)&IF(cal!$X$4=1,\" cm\",IF(cal!$X$4=2,\" in\"))&\" (Type 5)\"","v":"Clima Canal høyde 0 cm bredde 0 cm lengde 0 cm (Type 5)"}]
[]
[]
[]
[]
[]
[{"$f":"cal!$Z$1&\" \"&$R$15&\" \"&ROUND(cal!Y52,1)&IF(cal!$X$4=1,\" cm\",IF(cal!$X$4=2,\" in\"))&\" \"&$R$16&\" \"&ROUND(cal!AA52,1)&IF(cal!$X$4=1,\" cm\",IF(cal!$X$4=2,\" in\"))&\" \"&$R$17&\" \"&ROUND(cal!AC52,1)&IF(cal!$X$4=1,\" cm\",IF(cal!$X$4=2,\" in\"))&\" (Type 6)\"","v":"Clima Canal høyde 0 cm bredde 0 cm lengde 0 cm (Type 6)"}]
[]
[]
[]
[]
[]
[{"$f":"cal!$Z$1&\" \"&$R$15&\" \"&ROUND(cal!Y58,1)&IF(cal!$X$4=1,\" cm\",IF(cal!$X$4=2,\" in\"))&\" \"&$R$16&\" \"&ROUND(cal!AA58,1)&IF(cal!$X$4=1,\" cm\",IF(cal!$X$4=2,\" in\"))&\" \"&$R$17&\" \"&ROUND(cal!AC58,1)&IF(cal!$X$4=1,\" cm\",IF(cal!$X$4=2,\" in\"))&\" (Type 7)\"","v":"Clima Canal høyde 0 cm bredde 0 cm lengde 0 cm (Type 7)"}]
[]
[]
[]
[]
[]
[{"$f":"cal!$Z$1&\" \"&$R$15&\" \"&ROUND(cal!Y64,1)&IF(cal!$X$4=1,\" cm\",IF(cal!$X$4=2,\" in\"))&\" \"&$R$16&\" \"&ROUND(cal!AA64,1)&IF(cal!$X$4=1,\" cm\",IF(cal!$X$4=2,\" in\"))&\" \"&$R$17&\" \"&ROUND(cal!AC64,1)&IF(cal!$X$4=1,\" cm\",IF(cal!$X$4=2,\" in\"))&\" (Type 8)\"","v":"Clima Canal høyde 0 cm bredde 0 cm lengde 0 cm (Type 8)"}]
[]
[]
[]
[]
[]
[{"$f":"cal!$Z$1&\" \"&$R$15&\" \"&ROUND(cal!Y70,1)&IF(cal!$X$4=1,\" cm\",IF(cal!$X$4=2,\" in\"))&\" \"&$R$16&\" \"&ROUND(cal!AA70,1)&IF(cal!$X$4=1,\" cm\",IF(cal!$X$4=2,\" in\"))&\" \"&$R$17&\" \"&ROUND(cal!AC70,1)&IF(cal!$X$4=1,\" cm\",IF(cal!$X$4=2,\" in\"))&\" (Type 9)\"","v":"Clima Canal høyde 0 cm bredde 0 cm lengde 0 cm (Type 9)"}]
[]
[]
[]
[]
[]
["*Testé selon EN 16430",null,null,null,null,null,null,null,null,null,null,null,{"$f":"cal!N70","v":"v2021-04-19"}]
["**Puissance sonore testé selon ISO 3741:2010"]
["***Pression sonore avec une atténuation ambiante du 8dB(A)"]

{"sheet":"SP","index":7,"n_rows":71,"n_cols":18,"rows_kept":71,"cut":false,"hidden":true,"merged":[[14,0,14,12],[20,0,20,12],[26,0,26,12],[32,0,32,12],[2,6,2,9],[3,6,3,9],[7,0,7,2],[7,5,7,8],[7,11,7,12],[8,0,8,2],[8,5,8,8],[5,11,5,12],[6,11,6,12],[10,5,10,7],[9,0,9,2],[9,5,9,8],[38,0,38,12],[44,0,44,12],[50,0,50,12],[56,0,56,12],[62,0,62,12]]}
[]
["Model"]
[]
["Conditions"]
[]
["Temperaturas",null,null,null,null,null,null,null,null,null,null,"Altitud"]
["Calefacción:",null,null,null,null,"Enfriamiento:",null,null,null,null,null,null,null,null,null,null,"Copiar todos los datos"]
["Agua impulsión",0,0,{"$f":"cal!E9","v":75},{"$f":"IF(cal!$X$4=1,\"°C\",IF(cal!$X$4=2,\"°F\"))","v":"°C"},{"$f":"A8","v":"Agua impulsión"},null,null,null,{"$f":"cal!K9","v":16},{"$f":"E8","v":"°C"},"Convers. de unidades",null,null,null,null,"Unidades-SI"]
["Agua retorno",0,0,{"$f":"cal!E10","v":65},{"$f":"E8","v":"°C"},{"$f":"A9","v":"Agua retorno"},null,null,null,{"$f":"cal!K10","v":19},{"$f":"E8","v":"°C"},null,null,null,null,null,"Unidades-Imperial"]
["Ambiente (bulbo seco)",0,0,{"$f":"cal!E11","v":20},{"$f":"E8","v":"°C"},{"$f":"A10","v":"Ambiente (bulbo seco)"},null,null,null,{"$f":"cal!K11","v":26},{"$f":"E8","v":"°C"}]
[null,null,null,null,null,"Humedad relativa",null,null,null,{"$f":"cal!K12","v":0.5}]
[]
[]
["Nivel de velocidad:"," Voltaje control [V]",{"$f":"CONCATENATE(\"Emisión calefacción * \",ROUND(D8,0),\"/\",ROUND(D9,0),\"/\",ROUND(D10,0),\" [\"&IF(cal!$X$4=1,\"W\",IF(cal!$X$4=2,\"Btu/h\"))&\"]\")","v":"Emisión calefacción * 75/65/20 [W]"},{"$f":"\"Caudal de agua, calefacción [\"&IF(cal!$X$4=1,\"l/h\",IF(cal!$X$4=2,\"GPM\"))&\"]\"","v":"Caudal de agua, calefacción [l/h]"},{"$f":"\"Pérdida de carga del agua [\"&IF(cal!$X$4=1,\"kPa\",IF(cal!$X$4=2,\"ftH2O\"))&\"]\"","v":"Pérdida de carga del agua [kPa]"},{"$f":"CONCATENATE(\"Emisión sensible Frío * \",ROUND(J8,0),\"/\",ROUND(J9,0),\"/\",ROUND(J10,0),\" [\"&IF(cal!$X$4=1,\"W\",IF(cal!$X$4=2,\"Btu/h\"))&\"]\")","v":"Emisión sensible Frío * 16/19/26 [W]"},{"$f":"CONCATENATE(\"Emisión total Frío * \",ROUND(J8,0),\"/\",ROUND(J9,0),\"/\",ROUND(J10,0),\" [\"&IF(cal!$X$4=1,\"W\",IF(cal!$X$4=2,\"Btu/h\"))&\"]\")","v":"Emisión total Frío * 16/19/26 [W]"},{"$f":"\"Caudal de agua, calefacción [\"&IF(cal!$X$4=1,\"l/h\",IF(cal!$X$4=2,\"GPM\"))&\"]\"","v":"Caudal de agua, calefacción [l/h]"},{"$f":"E14","v":"Pérdida de carga del agua [kPa]"},"Presión sonora *** [dB(A)]","Potencia sonora ** [dB(A)]","Potencia eléctrica absorbida [W]",{"$f":"\"Caudal de aire [\"&IF(cal!$X$4=1,\"m³/h\",IF(cal!$X$4=2,\"CFM\"))&\"]\"","v":"Caudal de aire [m³/h]"},{"$f":"\"Temperatura salida de aire calefacción [\"&IF(cal!$X$4=1,\"°C\",IF(cal!$X$4=2,\"°F\"))&\"]\"","v":"Temperatura salida de aire calefacción [°C]"},{"$f":"\"Temperatura salida de aire refrigeración [\"&IF(cal!$X$4=1,\"°C\",IF(cal!$X$4=2,\"°F\"))&\"]\"","v":"Temperatura salida de aire refrigeración [°C]"}]
[{"$f":"cal!$Z$1&\" \"&$R$15&\" \"&ROUND(cal!Y22,1)&IF(cal!$X$4=1,\" cm\",IF(cal!$X$4=2,\" in\"))&\" \"&$R$16&\" \"&ROUND(cal!AA22,1)&IF(cal!$X$4=1,\" cm\",IF(cal!$X$4=2,\" in\"))&\" \"&$R$17&\" \"&ROUND(cal!AC22,1)&IF(cal!$X$4=1,\" cm\",IF(cal!$X$4=2,\" in\"))&\" (Type 1)\"","v":"Clima Canal altura 19 cm ancho 34 cm longitud 105 cm (Type 1)"},null,null,null,null,null,null,null,null,null,null,null,null,null,null,null,"Temp.","altura"]
[null,null,null,null,null,null,null,null,null,null,null,null,null,null,null,null,"calefac.","ancho"]
[null,null,null,null,null,null,null,null,null,null,null,null,null,null,null,null,"enfria.","longitud"]
[]
[]
[]
[{"$f":"cal!$Z$1&\" \"&$R$15&\" \"&ROUND(cal!Y28,1)&IF(cal!$X$4=1,\" cm\",IF(cal!$X$4=2,\" in\"))&\" \"&$R$16&\" \"&ROUND(cal!AA28,1)&IF(cal!$X$4=1,\" cm\",IF(cal!$X$4=2,\" in\"))&\" \"&$R$17&\" \"&ROUND(cal!AC28,1)&IF(cal!$X$4=1,\" cm\",IF(cal!$X$4=2,\" in\"))&\" (Type 2)\"","v":"Clima Canal altura 19 cm ancho 34 cm longitud 120 cm (Type 2)"}]
[]
[]
[]
[]
[]
[{"$f":"cal!$Z$1&\" \"&$R$15&\" \"&ROUND(cal!Y34,1)&IF(cal!$X$4=1,\" cm\",IF(cal!$X$4=2,\" in\"))&\" \"&$R$16&\" \"&ROUND(cal!AA34,1)&IF(cal!$X$4=1,\" cm\",IF(cal!$X$4=2,\" in\"))&\" \"&$R$17&\" \"&ROUND(cal!AC34,1)&IF(cal!$X$4=1,\" cm\",IF(cal!$X$4=2,\" in\"))&\" (Type 3)\"","v":"Clima Canal altura 19 cm ancho 34 cm longitud 200 cm (Type 3)"}]
[]
[]
[]
[]
[]
[{"$f":"cal!$Z$1&\" \"&$R$15&\" \"&ROUND(cal!Y40,1)&IF(cal!$X$4=1,\" cm\",IF(cal!$X$4=2,\" in\"))&\" \"&$R$16&\" \"&ROUND(cal!AA40,1)&IF(cal!$X$4=1,\" cm\",IF(cal!$X$4=2,\" in\"))&\" \"&$R$17&\" \"&ROUND(cal!AC40,1)&IF(cal!$X$4=1,\" cm\",IF(cal!$X$4=2,\" in\"))&\" (Type 4)\"","v":"Clima Canal altura 19 cm ancho 34 cm longitud 280 cm (Type 4)"}]
[]
[]
[]
[]
[]
[{"$f":"cal!$Z$1&\" \"&$R$15&\" \"&ROUND(cal!Y46,1)&IF(cal!$X$4=1,\" cm\",IF(cal!$X$4=2,\" in\"))&\" \"&$R$16&\" \"&ROUND(cal!AA46,1)&IF(cal!$X$4=1,\" cm\",IF(cal!$X$4=2,\" in\"))&\" \"&$R$17&\" \"&ROUND(cal!AC46,1)&IF(cal!$X$4=1,\" cm\",IF(cal!$X$4=2,\" in\"))&\" (Type 5)\"","v":"Clima Canal altura 0 cm ancho 0 cm longitud 0 cm (Type 5)"}]
[]
[]
[]
[]
[]
[{"$f":"cal!$Z$1&\" \"&$R$15&\" \"&ROUND(cal!Y52,1)&IF(cal!$X$4=1,\" cm\",IF(cal!$X$4=2,\" in\"))&\" \"&$R$16&\" \"&ROUND(cal!AA52,1)&IF(cal!$X$4=1,\" cm\",IF(cal!$X$4=2,\" in\"))&\" \"&$R$17&\" \"&ROUND(cal!AC52,1)&IF(cal!$X$4=1,\" cm\",IF(cal!$X$4=2,\" in\"))&\" (Type 6)\"","v":"Clima Canal altura 0 cm ancho 0 cm longitud 0 cm (Type 6)"}]
[]
[]
[]
[]
[]
[{"$f":"cal!$Z$1&\" \"&$R$15&\" \"&ROUND(cal!Y58,1)&IF(cal!$X$4=1,\" cm\",IF(cal!$X$4=2,\" in\"))&\" \"&$R$16&\" \"&ROUND(cal!AA58,1)&IF(cal!$X$4=1,\" cm\",IF(cal!$X$4=2,\" in\"))&\" \"&$R$17&\" \"&ROUND(cal!AC58,1)&IF(cal!$X$4=1,\" cm\",IF(cal!$X$4=2,\" in\"))&\" (Type 7)\"","v":"Clima Canal altura 0 cm ancho 0 cm longitud 0 cm (Type 7)"}]
[]
[]
[]
[]
[]
[{"$f":"cal!$Z$1&\" \"&$R$15&\" \"&ROUND(cal!Y64,1)&IF(cal!$X$4=1,\" cm\",IF(cal!$X$4=2,\" in\"))&\" \"&$R$16&\" \"&ROUND(cal!AA64,1)&IF(cal!$X$4=1,\" cm\",IF(cal!$X$4=2,\" in\"))&\" \"&$R$17&\" \"&ROUND(cal!AC64,1)&IF(cal!$X$4=1,\" cm\",IF(cal!$X$4=2,\" in\"))&\" (Type 8)\"","v":"Clima Canal altura 0 cm ancho 0 cm longitud 0 cm (Type 8)"}]
[]
[]
[]
[]
[]
[{"$f":"cal!$Z$1&\" \"&$R$15&\" \"&ROUND(cal!Y70,1)&IF(cal!$X$4=1,\" cm\",IF(cal!$X$4=2,\" in\"))&\" \"&$R$16&\" \"&ROUND(cal!AA70,1)&IF(cal!$X$4=1,\" cm\",IF(cal!$X$4=2,\" in\"))&\" \"&$R$17&\" \"&ROUND(cal!AC70,1)&IF(cal!$X$4=1,\" cm\",IF(cal!$X$4=2,\" in\"))&\" (Type 9)\"","v":"Clima Canal altura 0 cm ancho 0 cm longitud 0 cm (Type 9)"}]
[]
[]
[]
[]
[]
["*La potencia de enfriamiento se calcula según la norma EN 16430 con ventiladores de todas las alturas.",null,null,null,null,null,null,null,null,null,null,null,{"$f":"cal!N70","v":"v2021-04-19"}]
["**Potencia sonora según ISO 3741: 2010."]
["***Nivel de presión acústica con una amortiguación ambiental supuesta de 8 dB (A)."]

{"sheet":"SW","index":8,"n_rows":71,"n_cols":18,"rows_kept":71,"cut":false,"hidden":true,"merged":[[5,11,5,12],[6,11,6,12],[7,5,7,8],[7,11,7,12],[8,5,8,8],[62,0,62,12],[9,5,9,8],[14,0,14,12],[20,0,20,12],[26,0,26,12],[10,5,10,8],[32,0,32,12],[38,0,38,12],[44,0,44,12],[50,0,50,12],[56,0,56,12]]}
[]
["Formulary"]
[]
["Conditions"]
[]
["Temperaturer",null,null,null,null,null,null,null,null,null,null,"Höjd över havet"]
["Värme:",null,null,null,null,"Kyla:",null,null,null,null,null,null,null,null,null,null,"Kopiera all data"]
["Tillopp",null,null,{"$f":"cal!E9","v":75},{"$f":"IF(cal!$X$4=1,\"°C\",IF(cal!$X$4=2,\"°F\"))","v":"°C"},{"$f":"A8","v":"Tillopp"},null,null,null,{"$f":"cal!K9","v":16},{"$f":"E8","v":"°C"},"Enhetssystem",null,null,null,null,"SI-enheter"]
["Retur",null,null,{"$f":"cal!E10","v":65},{"$f":"E8","v":"°C"},{"$f":"A9","v":"Retur"},null,null,null,{"$f":"cal!K10","v":19},{"$f":"E8","v":"°C"},null,null,null,null,null,"Imperiella-enheter"]
["Rum (torr)",null,null,{"$f":"cal!E11","v":20},{"$f":"E8","v":"°C"},{"$f":"A10","v":"Rum (torr)"},null,null,null,{"$f":"cal!K11","v":26},{"$f":"E8","v":"°C"}]
[null,null,null,null,null,"rel. Fuktighet",null,null,null,{"$f":"cal!K12","v":0.5}]
[]
[]
["Fläkthastighet","Spänning, Fläkt [V]",{"$f":"CONCATENATE(\"Värme effekt * \",ROUND(D8,0),\"/\",ROUND(D9,0),\"/\",ROUND(D10,0),\" [\"&IF(cal!$X$4=1,\"W\",IF(cal!$X$4=2,\"Btu/h\"))&\"]\")","v":"Värme effekt * 75/65/20 [W]"},{"$f":"\"Vattenflöde, värme [\"&IF(cal!$X$4=1,\"l/h\",IF(cal!$X$4=2,\"GPM\"))&\"]\"","v":"Vattenflöde, värme [l/h]"},{"$f":"\"Tryckfall, vatten [\"&IF(cal!$X$4=1,\"kPa\",IF(cal!$X$4=2,\"inH2O\"))&\"]\"","v":"Tryckfall, vatten [kPa]"},{"$f":"CONCATENATE(\"Märkbar kylkapacitet * \",ROUND(J8,0),\"/\",ROUND(J9,0),\"/\",ROUND(J10,0),\" [\"&IF(cal!$X$4=1,\"W\",IF(cal!$X$4=2,\"Btu/h\"))&\"]\")","v":"Märkbar kylkapacitet * 16/19/26 [W]"},{"$f":"CONCATENATE(\"Total kylkapacitet \",ROUND(J8,0),\"/\",ROUND(J9,0),\"/\",ROUND(J10,0),\" [\"&IF(cal!$X$4=1,\"W\",IF(cal!$X$4=2,\"Btu/h\"))&\"]\")","v":"Total kylkapacitet 16/19/26 [W]"},{"$f":"\"Vattenflöde, kyla [\"&IF(cal!$X$4=1,\"l/h\",IF(cal!$X$4=2,\"GPM\"))&\"]\"","v":"Vattenflöde, kyla [l/h]"},{"$f":"E14","v":"Tryckfall, vatten [kPa]"},"Ljudtryck *** [dB(A)]","Ljudeffekt ** [dB(A)]","Effektförbrukning [W]",{"$f":"\"Luftflöde [\"&IF(cal!$X$4=1,\"m³/h\",IF(cal!$X$4=2,\"CFM\"))&\"]\"","v":"Luftflöde [m³/h]"},{"$f":"\"Air exhaust temp. heating [\"&IF(cal!$X$4=1,\"°C\",IF(cal!$X$4=2,\"°F\"))&\"]\"","v":"Air exhaust temp. heating [°C]"},{"$f":"\"Air exhaust temp. cooling [\"&IF(cal!$X$4=1,\"°C\",IF(cal!$X$4=2,\"°F\"))&\"]\"","v":"Air exhaust temp. cooling [°C]"}]
[{"$f":"cal!$Z$1&\" \"&$R$15&\" \"&ROUND(cal!Y22,1)&IF(cal!$X$4=1,\" cm\",IF(cal!$X$4=2,\" in\"))&\" \"&$R$16&\" \"&ROUND(cal!AA22,1)&IF(cal!$X$4=1,\" cm\",IF(cal!$X$4=2,\" in\"))&\" \"&$R$17&\" \"&ROUND(cal!AC22,1)&IF(cal!$X$4=1,\" cm\",IF(cal!$X$4=2,\" in\"))&\" (Typ 1)\"","v":"Clima Canal höjd 19 cm djup 34 cm längd 105 cm (Typ 1)"},null,null,null,null,null,null,null,null,null,null,null,null,null,null,null,"Temp.","höjd"]
[null,null,null,null,null,null,null,null,null,null,null,null,null,null,null,null,"värme!","djup"]
[null,null,null,null,null,null,null,null,null,null,null,null,null,null,null,null,"kyla!","längd"]
[]
[]
[]
[{"$f":"cal!$Z$1&\" \"&$R$15&\" \"&ROUND(cal!Y28,1)&IF(cal!$X$4=1,\" cm\",IF(cal!$X$4=2,\" in\"))&\" \"&$R$16&\" \"&ROUND(cal!AA28,1)&IF(cal!$X$4=1,\" cm\",IF(cal!$X$4=2,\" in\"))&\" \"&$R$17&\" \"&ROUND(cal!AC28,1)&IF(cal!$X$4=1,\" cm\",IF(cal!$X$4=2,\" in\"))&\" (Typ 2)\"","v":"Clima Canal höjd 19 cm djup 34 cm längd 120 cm (Typ 2)"}]
[]
[]
[]
[]
[]
[{"$f":"cal!$Z$1&\" \"&$R$15&\" \"&ROUND(cal!Y34,1)&IF(cal!$X$4=1,\" cm\",IF(cal!$X$4=2,\" in\"))&\" \"&$R$16&\" \"&ROUND(cal!AA34,1)&IF(cal!$X$4=1,\" cm\",IF(cal!$X$4=2,\" in\"))&\" \"&$R$17&\" \"&ROUND(cal!AC34,1)&IF(cal!$X$4=1,\" cm\",IF(cal!$X$4=2,\" in\"))&\" (Typ 3)\"","v":"Clima Canal höjd 19 cm djup 34 cm längd 200 cm (Typ 3)"}]
[]
[]
[]
[]
[]
[{"$f":"cal!$Z$1&\" \"&$R$15&\" \"&ROUND(cal!Y40,1)&IF(cal!$X$4=1,\" cm\",IF(cal!$X$4=2,\" in\"))&\" \"&$R$16&\" \"&ROUND(cal!AA40,1)&IF(cal!$X$4=1,\" cm\",IF(cal!$X$4=2,\" in\"))&\" \"&$R$17&\" \"&ROUND(cal!AC40,1)&IF(cal!$X$4=1,\" cm\",IF(cal!$X$4=2,\" in\"))&\" (Typ 4)\"","v":"Clima Canal höjd 19 cm djup 34 cm längd 280 cm (Typ 4)"}]
[]
[]
[]
[]
[]
[{"$f":"cal!$Z$1&\" \"&$R$15&\" \"&ROUND(cal!Y46,1)&IF(cal!$X$4=1,\" cm\",IF(cal!$X$4=2,\" in\"))&\" \"&$R$16&\" \"&ROUND(cal!AA46,1)&IF(cal!$X$4=1,\" cm\",IF(cal!$X$4=2,\" in\"))&\" \"&$R$17&\" \"&ROUND(cal!AC46,1)&IF(cal!$X$4=1,\" cm\",IF(cal!$X$4=2,\" in\"))&\" (Typ 5)\"","v":"Clima Canal höjd 0 cm djup 0 cm längd 0 cm (Typ 5)"}]
[]
[]
[]
[]
[]
[{"$f":"cal!$Z$1&\" \"&$R$15&\" \"&ROUND(cal!Y52,1)&IF(cal!$X$4=1,\" cm\",IF(cal!$X$4=2,\" in\"))&\" \"&$R$16&\" \"&ROUND(cal!AA52,1)&IF(cal!$X$4=1,\" cm\",IF(cal!$X$4=2,\" in\"))&\" \"&$R$17&\" \"&ROUND(cal!AC52,1)&IF(cal!$X$4=1,\" cm\",IF(cal!$X$4=2,\" in\"))&\" (Typ 6)\"","v":"Clima Canal höjd 0 cm djup 0 cm längd 0 cm (Typ 6)"}]
[]
[]
[]
[]
[]
[{"$f":"cal!$Z$1&\" \"&$R$15&\" \"&ROUND(cal!Y58,1)&IF(cal!$X$4=1,\" cm\",IF(cal!$X$4=2,\" in\"))&\" \"&$R$16&\" \"&ROUND(cal!AA58,1)&IF(cal!$X$4=1,\" cm\",IF(cal!$X$4=2,\" in\"))&\" \"&$R$17&\" \"&ROUND(cal!AC58,1)&IF(cal!$X$4=1,\" cm\",IF(cal!$X$4=2,\" in\"))&\" (Typ 7)\"","v":"Clima Canal höjd 0 cm djup 0 cm längd 0 cm (Typ 7)"}]
[]
[]
[]
[]
[]
[{"$f":"cal!$Z$1&\" \"&$R$15&\" \"&ROUND(cal!Y64,1)&IF(cal!$X$4=1,\" cm\",IF(cal!$X$4=2,\" in\"))&\" \"&$R$16&\" \"&ROUND(cal!AA64,1)&IF(cal!$X$4=1,\" cm\",IF(cal!$X$4=2,\" in\"))&\" \"&$R$17&\" \"&ROUND(cal!AC64,1)&IF(cal!$X$4=1,\" cm\",IF(cal!$X$4=2,\" in\"))&\" (Typ 8)\"","v":"Clima Canal höjd 0 cm djup 0 cm längd 0 cm (Typ 8)"}]
[]
[]
[]
[]
[]
[{"$f":"cal!$Z$1&\" \"&$R$15&\" \"&ROUND(cal!Y70,1)&IF(cal!$X$4=1,\" cm\",IF(cal!$X$4=2,\" in\"))&\" \"&$R$16&\" \"&ROUND(cal!AA70,1)&IF(cal!$X$4=1,\" cm\",IF(cal!$X$4=2,\" in\"))&\" \"&$R$17&\" \"&ROUND(cal!AC70,1)&IF(cal!$X$4=1,\" cm\",IF(cal!$X$4=2,\" in\"))&\" (Typ 9)\"","v":"Clima Canal höjd 0 cm djup 0 cm längd 0 cm (Typ 9)"}]
[]
[]
[]
[]
[]
["*Värden enligt EN16430",null,null,null,null,null,null,null,null,null,null,null,{"$f":"cal!N70","v":"v2021-04-19"}]
["**Ljudeffekt enligt ISO 3741: 2010"]
["***Ljudtryck med en antagen rumsdämpning på 8dB (A),"]

{"sheet":"TS","index":9,"n_rows":71,"n_cols":18,"rows_kept":71,"cut":false,"hidden":true,"merged":[[8,0,8,2],[8,5,8,8],[5,11,5,12],[6,11,6,12],[7,0,7,2],[7,5,7,8],[7,11,7,12],[62,0,62,12],[9,0,9,2],[9,5,9,8],[10,5,10,7],[14,0,14,12],[20,0,20,12],[26,0,26,12],[32,0,32,12],[38,0,38,12],[44,0,44,12],[50,0,50,12],[56,0,56,12]]}
[]
["Formulary"]
[]
["Conditions"]
[]
["Teploty",null,null,null,null,null,null,null,null,null,null,"Výška umístění"]
["Topení:",null,null,null,null,"Chlazení:",null,null,null,null,null,null,null,null,null,null,"Kopírovat všechna data"]
["Voda na přívodu",null,null,{"$f":"cal!E9","v":75},{"$f":"IF(cal!$X$4=1,\"°C\",IF(cal!$X$4=2,\"°F\"))","v":"°C"},{"$f":"A8","v":"Voda na přívodu"},null,null,null,{"$f":"cal!K9","v":16},{"$f":"E8","v":"°C"},"Převod jednotek",null,null,null,null,"Mezinárodní (Sl)"]
["Voda na zpátečce",null,null,{"$f":"cal!E10","v":65},{"$f":"E8","v":"°C"},{"$f":"A9","v":"Voda na zpátečce"},null,null,null,{"$f":"cal!K10","v":19},{"$f":"E8","v":"°C"},null,null,null,null,null,"Imperiální"]
["\"Suchá\" Teplota vzduchu",null,null,{"$f":"cal!E11","v":20},{"$f":"E8","v":"°C"},{"$f":"A10","v":"\"Suchá\" Teplota vzduchu"},null,null,null,{"$f":"cal!K11","v":26},{"$f":"E8","v":"°C"}]
[null,null,null,null,null,"Relativní vlhkost",null,null,null,{"$f":"cal!K12","v":0.5}]
[]
[]
["Rychlost","Ovládací napětí [V]",{"$f":"CONCATENATE(\"Výkon Topení * \",ROUND(D8,0),\"/\",ROUND(D9,0),\"/\",ROUND(D10,0),\" [\"&IF(cal!$X$4=1,\"W\",IF(cal!$X$4=2,\"Btu/h\"))&\"]\")","v":"Výkon Topení * 75/65/20 [W]"},{"$f":"\"Průtok vody, topení [\"&IF(cal!$X$4=1,\"l/h\",IF(cal!$X$4=2,\"GPM\"))&\"]\"","v":"Průtok vody, topení [l/h]"},{"$f":"\"Tlaková ztráta [\"&IF(cal!$X$4=1,\"kPa\",IF(cal!$X$4=2,\"inH2O\"))&\"]\"","v":"Tlaková ztráta [kPa]"},{"$f":"CONCATENATE(\"Výkon chlazení Znatelný * \",ROUND(J8,0),\"/\",ROUND(J9,0),\"/\",ROUND(J10,0),\" [\"&IF(cal!$X$4=1,\"W\",IF(cal!$X$4=2,\"Btu/h\"))&\"]\")","v":"Výkon chlazení Znatelný * 16/19/26 [W]"},{"$f":"CONCATENATE(\"Výkon chlazení Celkový \",ROUND(J8,0),\"/\",ROUND(J9,0),\"/\",ROUND(J10,0),\" [\"&IF(cal!$X$4=1,\"W\",IF(cal!$X$4=2,\"Btu/h\"))&\"]\")","v":"Výkon chlazení Celkový 16/19/26 [W]"},{"$f":"\"Průtok vody,chlazení [\"&IF(cal!$X$4=1,\"l/h\",IF(cal!$X$4=2,\"GPM\"))&\"]\"","v":"Průtok vody,chlazení [l/h]"},{"$f":"E14","v":"Tlaková ztráta [kPa]"},"Akustický tlak *** [dB(A)]","Akustický výkon ** [dB(A)]","Elektrický výkon [W]",{"$f":"\"Průtok vzduchu [\"&IF(cal!$X$4=1,\"m³/h\",IF(cal!$X$4=2,\"CFM\"))&\"]\"","v":"Průtok vzduchu [m³/h]"},{"$f":"\"Air exhaust temp. heating [\"&IF(cal!$X$4=1,\"°C\",IF(cal!$X$4=2,\"°F\"))&\"]\"","v":"Air exhaust temp. heating [°C]"},{"$f":"\"Air exhaust temp. cooling [\"&IF(cal!$X$4=1,\"°C\",IF(cal!$X$4=2,\"°F\"))&\"]\"","v":"Air exhaust temp. cooling [°C]"}]
[{"$f":"cal!$Z$1&\", \"&$R$15&\" \"&ROUND(cal!Y22,1)&IF(cal!$X$4=1,\" cm\",IF(cal!$X$4=2,\" in\"))&\", \"&$R$16&\" \"&ROUND(cal!AA22,1)&IF(cal!$X$4=1,\" cm\",IF(cal!$X$4=2,\" in\"))&\", \"&$R$17&\" \"&ROUND(cal!AC22,1)&IF(cal!$X$4=1,\" cm\",IF(cal!$X$4=2,\" in\"))&\" (Typ 1)\"","v":"Clima Canal, Výška 19 cm, Šířka 34 cm, Délka 105 cm (Typ 1)"},null,null,null,null,null,null,null,null,null,null,null,null,null,null,null,"Teploty","Výška"]
[null,null,null,null,null,null,null,null,null,null,null,null,null,null,null,null,"topení!","Šířka"]
[null,null,null,null,null,null,null,null,null,null,null,null,null,null,null,null,"chlazení!","Délka"]
[]
[]
[]
[{"$f":"cal!$Z$1&\" \"&$R$15&\" \"&ROUND(cal!Y28,1)&IF(cal!$X$4=1,\" cm\",IF(cal!$X$4=2,\" in\"))&\" \"&$R$16&\" \"&ROUND(cal!AA28,1)&IF(cal!$X$4=1,\" cm\",IF(cal!$X$4=2,\" in\"))&\" \"&$R$17&\" \"&ROUND(cal!AC28,1)&IF(cal!$X$4=1,\" cm\",IF(cal!$X$4=2,\" in\"))&\" (Typ 2)\"","v":"Clima Canal Výška 19 cm Šířka 34 cm Délka 120 cm (Typ 2)"}]
[]
[]
[]
[]
[]
[{"$f":"cal!$Z$1&\" \"&$R$15&\" \"&ROUND(cal!Y34,1)&IF(cal!$X$4=1,\" cm\",IF(cal!$X$4=2,\" in\"))&\" \"&$R$16&\" \"&ROUND(cal!AA34,1)&IF(cal!$X$4=1,\" cm\",IF(cal!$X$4=2,\" in\"))&\" \"&$R$17&\" \"&ROUND(cal!AC34,1)&IF(cal!$X$4=1,\" cm\",IF(cal!$X$4=2,\" in\"))&\" (Type 3)\"","v":"Clima Canal Výška 19 cm Šířka 34 cm Délka 200 cm (Type 3)"}]
[]
[]
[]
[]
[]
[{"$f":"cal!$Z$1&\" \"&$R$15&\" \"&ROUND(cal!Y40,1)&IF(cal!$X$4=1,\" cm\",IF(cal!$X$4=2,\" in\"))&\" \"&$R$16&\" \"&ROUND(cal!AA40,1)&IF(cal!$X$4=1,\" cm\",IF(cal!$X$4=2,\" in\"))&\" \"&$R$17&\" \"&ROUND(cal!AC40,1)&IF(cal!$X$4=1,\" cm\",IF(cal!$X$4=2,\" in\"))&\" (Typ 4)\"","v":"Clima Canal Výška 19 cm Šířka 34 cm Délka 280 cm (Typ 4)"}]
[]
[]
[]
[]
[]
[{"$f":"cal!$Z$1&\" \"&$R$15&\" \"&ROUND(cal!Y46,1)&IF(cal!$X$4=1,\" cm\",IF(cal!$X$4=2,\" in\"))&\" \"&$R$16&\" \"&ROUND(cal!AA46,1)&IF(cal!$X$4=1,\" cm\",IF(cal!$X$4=2,\" in\"))&\" \"&$R$17&\" \"&ROUND(cal!AC46,1)&IF(cal!$X$4=1,\" cm\",IF(cal!$X$4=2,\" in\"))&\" (Typ 5)\"","v":"Clima Canal Výška 0 cm Šířka 0 cm Délka 0 cm (Typ 5)"}]
[]
[]
[]
[]
[]
[{"$f":"cal!$Z$1&\" \"&$R$15&\" \"&ROUND(cal!Y52,1)&IF(cal!$X$4=1,\" cm\",IF(cal!$X$4=2,\" in\"))&\" \"&$R$16&\" \"&ROUND(cal!AA52,1)&IF(cal!$X$4=1,\" cm\",IF(cal!$X$4=2,\" in\"))&\" \"&$R$17&\" \"&ROUND(cal!AC52,1)&IF(cal!$X$4=1,\" cm\",IF(cal!$X$4=2,\" in\"))&\" (Typ 6)\"","v":"Clima Canal Výška 0 cm Šířka 0 cm Délka 0 cm (Typ 6)"}]
[]
[]
[]
[]
[]
[{"$f":"cal!$Z$1&\" \"&$R$15&\" \"&ROUND(cal!Y58,1)&IF(cal!$X$4=1,\" cm\",IF(cal!$X$4=2,\" in\"))&\" \"&$R$16&\" \"&ROUND(cal!AA58,1)&IF(cal!$X$4=1,\" cm\",IF(cal!$X$4=2,\" in\"))&\" \"&$R$17&\" \"&ROUND(cal!AC58,1)&IF(cal!$X$4=1,\" cm\",IF(cal!$X$4=2,\" in\"))&\" (Typ 7)\"","v":"Clima Canal Výška 0 cm Šířka 0 cm Délka 0 cm (Typ 7)"}]
[]
[]
[]
[]
[]
[{"$f":"cal!$Z$1&\" \"&$R$15&\" \"&ROUND(cal!Y64,1)&IF(cal!$X$4=1,\" cm\",IF(cal!$X$4=2,\" in\"))&\" \"&$R$16&\" \"&ROUND(cal!AA64,1)&IF(cal!$X$4=1,\" cm\",IF(cal!$X$4=2,\" in\"))&\" \"&$R$17&\" \"&ROUND(cal!AC64,1)&IF(cal!$X$4=1,\" cm\",IF(cal!$X$4=2,\" in\"))&\" (Typ 8)\"","v":"Clima Canal Výška 0 cm Šířka 0 cm Délka 0 cm (Typ 8)"}]
[]
[]
[]
[]
[]
[{"$f":"cal!$Z$1&\" \"&$R$15&\" \"&ROUND(cal!Y70,1)&IF(cal!$X$4=1,\" cm\",IF(cal!$X$4=2,\" in\"))&\" \"&$R$16&\" \"&ROUND(cal!AA70,1)&IF(cal!$X$4=1,\" cm\",IF(cal!$X$4=2,\" in\"))&\" \"&$R$17&\" \"&ROUND(cal!AC70,1)&IF(cal!$X$4=1,\" cm\",IF(cal!$X$4=2,\" in\"))&\" (Typ 9)\"","v":"Clima Canal Výška 0 cm Šířka 0 cm Délka 0 cm (Typ 9)"}]
[]
[]
[]
[]
[]
["*Hodnoty podle EN16430",null,null,null,null,null,null,null,null,null,null,null,{"$f":"cal!N70","v":"v2021-04-19"}]
["**Akustický tlak podle ISO 3741:2010"]
["***Akustický výkon s předpokládaným útlumem místnosti 8 dB (A)."]

{"sheet":"ExtraTaal1","index":10,"n_rows":71,"n_cols":18,"rows_kept":71,"cut":false,"hidden":true,"merged":[[8,0,8,2],[8,5,8,8],[5,11,5,12],[6,11,6,12],[7,0,7,2],[7,5,7,8],[7,11,7,12],[62,0,62,12],[9,0,9,2],[9,5,9,8],[10,5,10,7],[14,0,14,12],[20,0,20,12],[26,0,26,12],[32,0,32,12],[38,0,38,12],[44,0,44,12],[50,0,50,12],[56,0,56,12]]}
[]
["Formulary"]
[]
["Conditions"]
[]
["Temperatures",null,null,null,null,null,null,null,null,null,null,"Altitude"]
["Heating:",null,null,null,null,"Cooling:",null,null,null,null,null,null,null,null,null,null,"Copy all data"]
[{"$f":"\"Inlet temp.\"","v":"Inlet temp."},null,null,{"$f":"cal!E9","v":75},{"$f":"IF(cal!$X$4=1,\"°C\",IF(cal!$X$4=2,\"°F\"))","v":"°C"},{"$f":"A8","v":"Inlet temp."},null,null,null,{"$f":"cal!K9","v":16},{"$f":"E8","v":"°C"},"Unit conversion",null,null,null,null,"SI-units"]
[{"$f":"\"Return temp.\"","v":"Return temp."},null,null,{"$f":"cal!E10","v":65},{"$f":"E8","v":"°C"},{"$f":"A9","v":"Return temp."},null,null,null,{"$f":"cal!K10","v":19},{"$f":"E8","v":"°C"},null,null,null,null,null,"Imperial-units"]
[{"$f":"\"Room temp.\"","v":"Room temp."},null,null,{"$f":"cal!E11","v":20},{"$f":"E8","v":"°C"},{"$f":"A10","v":"Room temp."},null,null,null,{"$f":"cal!K11","v":26},{"$f":"E8","v":"°C"}]
[null,null,null,null,null,"Relative humidity",null,null,null,{"$f":"cal!K12","v":0.5}]
[]
[]
["Speed level:","Control voltage [V]",{"$f":"CONCATENATE(\"Heat output * \",ROUND(D8,0),\"/\",ROUND(D9,0),\"/\",ROUND(D10,0),\" [\"&IF(cal!$X$4=1,\"W\",IF(cal!$X$4=2,\"Btu/h\"))&\"]\")","v":"Heat output * 75/65/20 [W]"},{"$f":"\"Water flowrate, heating [\"&IF(cal!$X$4=1,\"l/h\",IF(cal!$X$4=2,\"GPM\"))&\"]\"","v":"Water flowrate, heating [l/h]"},{"$f":"\"Watersided pressure loss [\"&IF(cal!$X$4=1,\"kPa\",IF(cal!$X$4=2,\"inH2O\"))&\"]\"","v":"Watersided pressure loss [kPa]"},{"$f":"CONCATENATE(\"Sens. cooling capacity * \",ROUND(J8,0),\"/\",ROUND(J9,0),\"/\",ROUND(J10,0),\" [\"&IF(cal!$X$4=1,\"W\",IF(cal!$X$4=2,\"Btu/h\"))&\"]\")","v":"Sens. cooling capacity * 16/19/26 [W]"},{"$f":"CONCATENATE(\"Tot. cooling capacity \",ROUND(J8,0),\"/\",ROUND(J9,0),\"/\",ROUND(J10,0),\" [\"&IF(cal!$X$4=1,\"W\",IF(cal!$X$4=2,\"Btu/h\"))&\"]\")","v":"Tot. cooling capacity 16/19/26 [W]"},{"$f":"\"Water flowrate, cooling [\"&IF(cal!$X$4=1,\"l/h\",IF(cal!$X$4=2,\"GPM\"))&\"]\"","v":"Water flowrate, cooling [l/h]"},{"$f":"\"Watersided pressure loss [\"&IF(cal!$X$4=1,\"kPa\",IF(cal!$X$4=2,\"inH2O\"))&\"]\"","v":"Watersided pressure loss [kPa]"},"Sound pressure *** [dB(A)]","Sound power ** [dB(A)]","Electrical power [W]",{"$f":"\"Air flowrate [\"&IF(cal!$X$4=1,\"m³/h\",IF(cal!$X$4=2,\"CFM\"))&\"]\"","v":"Air flowrate [m³/h]"},{"$f":"\"Air exhaust temp. heating [\"&IF(cal!$X$4=1,\"°C\",IF(cal!$X$4=2,\"°F\"))&\"]\"","v":"Air exhaust temp. heating [°C]"},{"$f":"\"Air exhaust temp. cooling [\"&IF(cal!$X$4=1,\"°C\",IF(cal!$X$4=2,\"°F\"))&\"]\"","v":"Air exhaust temp. cooling [°C]"}]
[{"$f":"cal!$Z$1&\" \"&$R$15&\" \"&ROUND(cal!Y22,1)&IF(cal!$X$4=1,\" cm\",IF(cal!$X$4=2,\" in\"))&\" \"&$R$16&\" \"&ROUND(cal!AA22,1)&IF(cal!$X$4=1,\" cm\",IF(cal!$X$4=2,\" in\"))&\" \"&$R$17&\" \"&ROUND(cal!AC22,1)&IF(cal!$X$4=1,\" cm\",IF(cal!$X$4=2,\" in\"))&\" (Type 1)\"","v":"Clima Canal height 19 cm width 34 cm length 105 cm (Type 1)"},null,null,null,null,null,null,null,null,null,null,null,null,null,null,null,"Temp.","height"]
[null,null,null,null,null,null,null,null,null,null,null,null,null,null,null,null,"heating!","width"]
[null,null,null,null,null,null,null,null,null,null,null,null,null,null,null,null,"cooling!","length"]
[]
[]
[]
[{"$f":"cal!$Z$1&\" \"&$R$15&\" \"&ROUND(cal!Y28,1)&IF(cal!$X$4=1,\" cm\",IF(cal!$X$4=2,\" in\"))&\" \"&$R$16&\" \"&ROUND(cal!AA28,1)&IF(cal!$X$4=1,\" cm\",IF(cal!$X$4=2,\" in\"))&\" \"&$R$17&\" \"&ROUND(cal!AC28,1)&IF(cal!$X$4=1,\" cm\",IF(cal!$X$4=2,\" in\"))&\" (Type 2)\"","v":"Clima Canal height 19 cm width 34 cm length 120 cm (Type 2)"}]
[]
[]
[]
[]
[]
[{"$f":"cal!$Z$1&\" \"&$R$15&\" \"&ROUND(cal!Y34,1)&IF(cal!$X$4=1,\" cm\",IF(cal!$X$4=2,\" in\"))&\" \"&$R$16&\" \"&ROUND(cal!AA34,1)&IF(cal!$X$4=1,\" cm\",IF(cal!$X$4=2,\" in\"))&\" \"&$R$17&\" \"&ROUND(cal!AC34,1)&IF(cal!$X$4=1,\" cm\",IF(cal!$X$4=2,\" in\"))&\" (Type 3)\"","v":"Clima Canal height 19 cm width 34 cm length 200 cm (Type 3)"}]
[]
[]
[]
[]
[]
[{"$f":"cal!$Z$1&\" \"&$R$15&\" \"&ROUND(cal!Y40,1)&IF(cal!$X$4=1,\" cm\",IF(cal!$X$4=2,\" in\"))&\" \"&$R$16&\" \"&ROUND(cal!AA40,1)&IF(cal!$X$4=1,\" cm\",IF(cal!$X$4=2,\" in\"))&\" \"&$R$17&\" \"&ROUND(cal!AC40,1)&IF(cal!$X$4=1,\" cm\",IF(cal!$X$4=2,\" in\"))&\" (Type 4)\"","v":"Clima Canal height 19 cm width 34 cm length 280 cm (Type 4)"}]
[]
[]
[]
[]
[]
[{"$f":"cal!$Z$1&\" \"&$R$15&\" \"&ROUND(cal!Y46,1)&IF(cal!$X$4=1,\" cm\",IF(cal!$X$4=2,\" in\"))&\" \"&$R$16&\" \"&ROUND(cal!AA46,1)&IF(cal!$X$4=1,\" cm\",IF(cal!$X$4=2,\" in\"))&\" \"&$R$17&\" \"&ROUND(cal!AC46,1)&IF(cal!$X$4=1,\" cm\",IF(cal!$X$4=2,\" in\"))&\" (Type 5)\"","v":"Clima Canal height 0 cm width 0 cm length 0 cm (Type 5)"}]
[]
[]
[]
[]
[]
[{"$f":"cal!$Z$1&\" \"&$R$15&\" \"&ROUND(cal!Y52,1)&IF(cal!$X$4=1,\" cm\",IF(cal!$X$4=2,\" in\"))&\" \"&$R$16&\" \"&ROUND(cal!AA52,1)&IF(cal!$X$4=1,\" cm\",IF(cal!$X$4=2,\" in\"))&\" \"&$R$17&\" \"&ROUND(cal!AC52,1)&IF(cal!$X$4=1,\" cm\",IF(cal!$X$4=2,\" in\"))&\" (Type 6)\"","v":"Clima Canal height 0 cm width 0 cm length 0 cm (Type 6)"}]
[]
[]
[]
[]
[]
[{"$f":"cal!$Z$1&\" \"&$R$15&\" \"&ROUND(cal!Y58,1)&IF(cal!$X$4=1,\" cm\",IF(cal!$X$4=2,\" in\"))&\" \"&$R$16&\" \"&ROUND(cal!AA58,1)&IF(cal!$X$4=1,\" cm\",IF(cal!$X$4=2,\" in\"))&\" \"&$R$17&\" \"&ROUND(cal!AC58,1)&IF(cal!$X$4=1,\" cm\",IF(cal!$X$4=2,\" in\"))&\" (Type 7)\"","v":"Clima Canal height 0 cm width 0 cm length 0 cm (Type 7)"}]
[]
[]
[]
[]
[]
[{"$f":"cal!$Z$1&\" \"&$R$15&\" \"&ROUND(cal!Y64,1)&IF(cal!$X$4=1,\" cm\",IF(cal!$X$4=2,\" in\"))&\" \"&$R$16&\" \"&ROUND(cal!AA64,1)&IF(cal!$X$4=1,\" cm\",IF(cal!$X$4=2,\" in\"))&\" \"&$R$17&\" \"&ROUND(cal!AC64,1)&IF(cal!$X$4=1,\" cm\",IF(cal!$X$4=2,\" in\"))&\" (Type 8)\"","v":"Clima Canal height 0 cm width 0 cm length 0 cm (Type 8)"}]
[]
[]
[]
[]
[]
[{"$f":"cal!$Z$1&\" \"&$R$15&\" \"&ROUND(cal!Y70,1)&IF(cal!$X$4=1,\" cm\",IF(cal!$X$4=2,\" in\"))&\" \"&$R$16&\" \"&ROUND(cal!AA70,1)&IF(cal!$X$4=1,\" cm\",IF(cal!$X$4=2,\" in\"))&\" \"&$R$17&\" \"&ROUND(cal!AC70,1)&IF(cal!$X$4=1,\" cm\",IF(cal!$X$4=2,\" in\"))&\" (Type 9)\"","v":"Clima Canal height 0 cm width 0 cm length 0 cm (Type 9)"}]
[]
[]
[]
[]
[]
["*Values according to EN 16430",null,null,null,null,null,null,null,null,null,null,null,{"$f":"cal!N70","v":"v2021-04-19"}]
["**Sound power according to ISO 3741:2010"]
["***Sound pressure with an assumed room damping of 8dB(A)"]

{"sheet":"ExtraTaal2","index":11,"n_rows":71,"n_cols":18,"rows_kept":71,"cut":false,"hidden":true,"merged":[[8,0,8,2],[8,5,8,8],[5,11,5,12],[6,11,6,12],[7,0,7,2],[7,5,7,8],[7,11,7,12],[62,0,62,12],[9,0,9,2],[9,5,9,8],[10,5,10,7],[14,0,14,12],[20,0,20,12],[26,0,26,12],[32,0,32,12],[38,0,38,12],[44,0,44,12],[50,0,50,12],[56,0,56,12]]}
[]
["Formulary"]
[]
["Conditions"]
[]
["Temperatures",null,null,null,null,null,null,null,null,null,null,"Altitude"]
["Heating:",null,null,null,null,"Cooling:",null,null,null,null,null,null,null,null,null,null,"Copy all data"]
[{"$f":"\"Inlet temp.\"","v":"Inlet temp."},null,null,{"$f":"cal!E9","v":75},{"$f":"IF(cal!$X$4=1,\"°C\",IF(cal!$X$4=2,\"°F\"))","v":"°C"},{"$f":"A8","v":"Inlet temp."},null,null,null,{"$f":"cal!K9","v":16},{"$f":"E8","v":"°C"},"Unit conversion",null,null,null,null,"SI-units"]
[{"$f":"\"Return temp.\"","v":"Return temp."},null,null,{"$f":"cal!E10","v":65},{"$f":"E8","v":"°C"},{"$f":"A9","v":"Return temp."},null,null,null,{"$f":"cal!K10","v":19},{"$f":"E8","v":"°C"},null,null,null,null,null,"Imperial-units"]
[{"$f":"\"Room temp.\"","v":"Room temp."},null,null,{"$f":"cal!E11","v":20},{"$f":"E8","v":"°C"},{"$f":"A10","v":"Room temp."},null,null,null,{"$f":"cal!K11","v":26},{"$f":"E8","v":"°C"}]
[null,null,null,null,null,"Relative humidity",null,null,null,{"$f":"cal!K12","v":0.5}]
[]
[]
["Speed level:","Control voltage [V]",{"$f":"CONCATENATE(\"Heat output * \",ROUND(D8,0),\"/\",ROUND(D9,0),\"/\",ROUND(D10,0),\" [\"&IF(cal!$X$4=1,\"W\",IF(cal!$X$4=2,\"Btu/h\"))&\"]\")","v":"Heat output * 75/65/20 [W]"},{"$f":"\"Water flowrate, heating [\"&IF(cal!$X$4=1,\"l/h\",IF(cal!$X$4=2,\"GPM\"))&\"]\"","v":"Water flowrate, heating [l/h]"},{"$f":"\"Watersided pressure loss [\"&IF(cal!$X$4=1,\"kPa\",IF(cal!$X$4=2,\"inH2O\"))&\"]\"","v":"Watersided pressure loss [kPa]"},{"$f":"CONCATENATE(\"Sens. cooling capacity * \",ROUND(J8,0),\"/\",ROUND(J9,0),\"/\",ROUND(J10,0),\" [\"&IF(cal!$X$4=1,\"W\",IF(cal!$X$4=2,\"Btu/h\"))&\"]\")","v":"Sens. cooling capacity * 16/19/26 [W]"},{"$f":"CONCATENATE(\"Tot. cooling capacity \",ROUND(J8,0),\"/\",ROUND(J9,0),\"/\",ROUND(J10,0),\" [\"&IF(cal!$X$4=1,\"W\",IF(cal!$X$4=2,\"Btu/h\"))&\"]\")","v":"Tot. cooling capacity 16/19/26 [W]"},{"$f":"\"Water flowrate, cooling [\"&IF(cal!$X$4=1,\"l/h\",IF(cal!$X$4=2,\"GPM\"))&\"]\"","v":"Water flowrate, cooling [l/h]"},{"$f":"\"Watersided pressure loss [\"&IF(cal!$X$4=1,\"kPa\",IF(cal!$X$4=2,\"inH2O\"))&\"]\"","v":"Watersided pressure loss [kPa]"},"Sound pressure *** [dB(A)]","Sound power ** [dB(A)]","Electrical power [W]",{"$f":"\"Air flowrate [\"&IF(cal!$X$4=1,\"m³/h\",IF(cal!$X$4=2,\"CFM\"))&\"]\"","v":"Air flowrate [m³/h]"},{"$f":"\"Air exhaust temp. heating [\"&IF(cal!$X$4=1,\"°C\",IF(cal!$X$4=2,\"°F\"))&\"]\"","v":"Air exhaust temp. heating [°C]"},{"$f":"\"Air exhaust temp. cooling [\"&IF(cal!$X$4=1,\"°C\",IF(cal!$X$4=2,\"°F\"))&\"]\"","v":"Air exhaust temp. cooling [°C]"}]
[{"$f":"cal!$Z$1&\" \"&$R$15&\" \"&ROUND(cal!Y22,1)&IF(cal!$X$4=1,\" cm\",IF(cal!$X$4=2,\" in\"))&\" \"&$R$16&\" \"&ROUND(cal!AA22,1)&IF(cal!$X$4=1,\" cm\",IF(cal!$X$4=2,\" in\"))&\" \"&$R$17&\" \"&ROUND(cal!AC22,1)&IF(cal!$X$4=1,\" cm\",IF(cal!$X$4=2,\" in\"))&\" (Type 1)\"","v":"Clima Canal height 19 cm width 34 cm length 105 cm (Type 1)"},null,null,null,null,null,null,null,null,null,null,null,null,null,null,null,"Temp.","height"]
[null,null,null,null,null,null,null,null,null,null,null,null,null,null,null,null,"heating!","width"]
[null,null,null,null,null,null,null,null,null,null,null,null,null,null,null,null,"cooling!","length"]
[]
[]
[]
[{"$f":"cal!$Z$1&\" \"&$R$15&\" \"&ROUND(cal!Y28,1)&IF(cal!$X$4=1,\" cm\",IF(cal!$X$4=2,\" in\"))&\" \"&$R$16&\" \"&ROUND(cal!AA28,1)&IF(cal!$X$4=1,\" cm\",IF(cal!$X$4=2,\" in\"))&\" \"&$R$17&\" \"&ROUND(cal!AC28,1)&IF(cal!$X$4=1,\" cm\",IF(cal!$X$4=2,\" in\"))&\" (Type 2)\"","v":"Clima Canal height 19 cm width 34 cm length 120 cm (Type 2)"}]
[]
[]
[]
[]
[]
[{"$f":"cal!$Z$1&\" \"&$R$15&\" \"&ROUND(cal!Y34,1)&IF(cal!$X$4=1,\" cm\",IF(cal!$X$4=2,\" in\"))&\" \"&$R$16&\" \"&ROUND(cal!AA34,1)&IF(cal!$X$4=1,\" cm\",IF(cal!$X$4=2,\" in\"))&\" \"&$R$17&\" \"&ROUND(cal!AC34,1)&IF(cal!$X$4=1,\" cm\",IF(cal!$X$4=2,\" in\"))&\" (Type 3)\"","v":"Clima Canal height 19 cm width 34 cm length 200 cm (Type 3)"}]
[]
[]
[]
[]
[]
[{"$f":"cal!$Z$1&\" \"&$R$15&\" \"&ROUND(cal!Y40,1)&IF(cal!$X$4=1,\" cm\",IF(cal!$X$4=2,\" in\"))&\" \"&$R$16&\" \"&ROUND(cal!AA40,1)&IF(cal!$X$4=1,\" cm\",IF(cal!$X$4=2,\" in\"))&\" \"&$R$17&\" \"&ROUND(cal!AC40,1)&IF(cal!$X$4=1,\" cm\",IF(cal!$X$4=2,\" in\"))&\" (Type 4)\"","v":"Clima Canal height 19 cm width 34 cm length 280 cm (Type 4)"}]
[]
[]
[]
[]
[]
[{"$f":"cal!$Z$1&\" \"&$R$15&\" \"&ROUND(cal!Y46,1)&IF(cal!$X$4=1,\" cm\",IF(cal!$X$4=2,\" in\"))&\" \"&$R$16&\" \"&ROUND(cal!AA46,1)&IF(cal!$X$4=1,\" cm\",IF(cal!$X$4=2,\" in\"))&\" \"&$R$17&\" \"&ROUND(cal!AC46,1)&IF(cal!$X$4=1,\" cm\",IF(cal!$X$4=2,\" in\"))&\" (Type 5)\"","v":"Clima Canal height 0 cm width 0 cm length 0 cm (Type 5)"}]
[]
[]
[]
[]
[]
[{"$f":"cal!$Z$1&\" \"&$R$15&\" \"&ROUND(cal!Y52,1)&IF(cal!$X$4=1,\" cm\",IF(cal!$X$4=2,\" in\"))&\" \"&$R$16&\" \"&ROUND(cal!AA52,1)&IF(cal!$X$4=1,\" cm\",IF(cal!$X$4=2,\" in\"))&\" \"&$R$17&\" \"&ROUND(cal!AC52,1)&IF(cal!$X$4=1,\" cm\",IF(cal!$X$4=2,\" in\"))&\" (Type 6)\"","v":"Clima Canal height 0 cm width 0 cm length 0 cm (Type 6)"}]
[]
[]
[]
[]
[]
[{"$f":"cal!$Z$1&\" \"&$R$15&\" \"&ROUND(cal!Y58,1)&IF(cal!$X$4=1,\" cm\",IF(cal!$X$4=2,\" in\"))&\" \"&$R$16&\" \"&ROUND(cal!AA58,1)&IF(cal!$X$4=1,\" cm\",IF(cal!$X$4=2,\" in\"))&\" \"&$R$17&\" \"&ROUND(cal!AC58,1)&IF(cal!$X$4=1,\" cm\",IF(cal!$X$4=2,\" in\"))&\" (Type 7)\"","v":"Clima Canal height 0 cm width 0 cm length 0 cm (Type 7)"}]
[]
[]
[]
[]
[]
[{"$f":"cal!$Z$1&\" \"&$R$15&\" \"&ROUND(cal!Y64,1)&IF(cal!$X$4=1,\" cm\",IF(cal!$X$4=2,\" in\"))&\" \"&$R$16&\" \"&ROUND(cal!AA64,1)&IF(cal!$X$4=1,\" cm\",IF(cal!$X$4=2,\" in\"))&\" \"&$R$17&\" \"&ROUND(cal!AC64,1)&IF(cal!$X$4=1,\" cm\",IF(cal!$X$4=2,\" in\"))&\" (Type 8)\"","v":"Clima Canal height 0 cm width 0 cm length 0 cm (Type 8)"}]
[]
[]
[]
[]
[]
[{"$f":"cal!$Z$1&\" \"&$R$15&\" \"&ROUND(cal!Y70,1)&IF(cal!$X$4=1,\" cm\",IF(cal!$X$4=2,\" in\"))&\" \"&$R$16&\" \"&ROUND(cal!AA70,1)&IF(cal!$X$4=1,\" cm\",IF(cal!$X$4=2,\" in\"))&\" \"&$R$17&\" \"&ROUND(cal!AC70,1)&IF(cal!$X$4=1,\" cm\",IF(cal!$X$4=2,\" in\"))&\" (Type 9)\"","v":"Clima Canal height 0 cm width 0 cm length 0 cm (Type 9)"}]
[]
[]
[]
[]
[]
["*Values according to EN 16430",null,null,null,null,null,null,null,null,null,null,null,{"$f":"cal!N70","v":"v2021-04-19"}]
["**Sound power according to ISO 3741:2010"]
["***Sound pressure with an assumed room damping of 8dB(A)"]

{"sheet":"ExtraTaal3","index":12,"n_rows":71,"n_cols":18,"rows_kept":71,"cut":false,"hidden":true,"merged":[[8,0,8,2],[8,5,8,8],[5,11,5,12],[6,11,6,12],[7,0,7,2],[7,5,7,8],[7,11,7,12],[62,0,62,12],[9,0,9,2],[9,5,9,8],[10,5,10,7],[14,0,14,12],[20,0,20,12],[26,0,26,12],[32,0,32,12],[38,0,38,12],[44,0,44,12],[50,0,50,12],[56,0,56,12]]}
[]
["Formulary"]
[]
["Conditions"]
[]
["Temperatures",null,null,null,null,null,null,null,null,null,null,"Altitude"]
["Heating:",null,null,null,null,"Cooling:",null,null,null,null,null,null,null,null,null,null,"Copy all data"]
[{"$f":"\"Inlet temp.\"","v":"Inlet temp."},null,null,{"$f":"cal!E9","v":75},{"$f":"IF(cal!$X$4=1,\"°C\",IF(cal!$X$4=2,\"°F\"))","v":"°C"},{"$f":"A8","v":"Inlet temp."},null,null,null,{"$f":"cal!K9","v":16},{"$f":"E8","v":"°C"},"Unit conversion",null,null,null,null,"SI-units"]
[{"$f":"\"Return temp.\"","v":"Return temp."},null,null,{"$f":"cal!E10","v":65},{"$f":"E8","v":"°C"},{"$f":"A9","v":"Return temp."},null,null,null,{"$f":"cal!K10","v":19},{"$f":"E8","v":"°C"},null,null,null,null,null,"Imperial-units"]
[{"$f":"\"Room temp.\"","v":"Room temp."},null,null,{"$f":"cal!E11","v":20},{"$f":"E8","v":"°C"},{"$f":"A10","v":"Room temp."},null,null,null,{"$f":"cal!K11","v":26},{"$f":"E8","v":"°C"}]
[null,null,null,null,null,"Relative humidity",null,null,null,{"$f":"cal!K12","v":0.5}]
[]
[]
["Speed level:","Control voltage [V]",{"$f":"CONCATENATE(\"Heat output * \",ROUND(D8,0),\"/\",ROUND(D9,0),\"/\",ROUND(D10,0),\" [\"&IF(cal!$X$4=1,\"W\",IF(cal!$X$4=2,\"Btu/h\"))&\"]\")","v":"Heat output * 75/65/20 [W]"},{"$f":"\"Water flowrate, heating [\"&IF(cal!$X$4=1,\"l/h\",IF(cal!$X$4=2,\"GPM\"))&\"]\"","v":"Water flowrate, heating [l/h]"},{"$f":"\"Watersided pressure loss [\"&IF(cal!$X$4=1,\"kPa\",IF(cal!$X$4=2,\"inH2O\"))&\"]\"","v":"Watersided pressure loss [kPa]"},{"$f":"CONCATENATE(\"Sens. cooling capacity * \",ROUND(J8,0),\"/\",ROUND(J9,0),\"/\",ROUND(J10,0),\" [\"&IF(cal!$X$4=1,\"W\",IF(cal!$X$4=2,\"Btu/h\"))&\"]\")","v":"Sens. cooling capacity * 16/19/26 [W]"},{"$f":"CONCATENATE(\"Tot. cooling capacity \",ROUND(J8,0),\"/\",ROUND(J9,0),\"/\",ROUND(J10,0),\" [\"&IF(cal!$X$4=1,\"W\",IF(cal!$X$4=2,\"Btu/h\"))&\"]\")","v":"Tot. cooling capacity 16/19/26 [W]"},{"$f":"\"Water flowrate, cooling [\"&IF(cal!$X$4=1,\"l/h\",IF(cal!$X$4=2,\"GPM\"))&\"]\"","v":"Water flowrate, cooling [l/h]"},{"$f":"\"Watersided pressure loss [\"&IF(cal!$X$4=1,\"kPa\",IF(cal!$X$4=2,\"inH2O\"))&\"]\"","v":"Watersided pressure loss [kPa]"},"Sound pressure *** [dB(A)]","Sound power ** [dB(A)]","Electrical power [W]",{"$f":"\"Air flowrate [\"&IF(cal!$X$4=1,\"m³/h\",IF(cal!$X$4=2,\"CFM\"))&\"]\"","v":"Air flowrate [m³/h]"},{"$f":"\"Air exhaust temp. heating [\"&IF(cal!$X$4=1,\"°C\",IF(cal!$X$4=2,\"°F\"))&\"]\"","v":"Air exhaust temp. heating [°C]"},{"$f":"\"Air exhaust temp. cooling [\"&IF(cal!$X$4=1,\"°C\",IF(cal!$X$4=2,\"°F\"))&\"]\"","v":"Air exhaust temp. cooling [°C]"}]
[{"$f":"cal!$Z$1&\" \"&$R$15&\" \"&ROUND(cal!Y22,1)&IF(cal!$X$4=1,\" cm\",IF(cal!$X$4=2,\" in\"))&\" \"&$R$16&\" \"&ROUND(cal!AA22,1)&IF(cal!$X$4=1,\" cm\",IF(cal!$X$4=2,\" in\"))&\" \"&$R$17&\" \"&ROUND(cal!AC22,1)&IF(cal!$X$4=1,\" cm\",IF(cal!$X$4=2,\" in\"))&\" (Type 1)\"","v":"Clima Canal height 19 cm width 34 cm length 105 cm (Type 1)"},null,null,null,null,null,null,null,null,null,null,null,null,null,null,null,"Temp.","height"]
[null,null,null,null,null,null,null,null,null,null,null,null,null,null,null,null,"heating!","width"]
[null,null,null,null,null,null,null,null,null,null,null,null,null,null,null,null,"cooling!","length"]
[]
[]
[]
[{"$f":"cal!$Z$1&\" \"&$R$15&\" \"&ROUND(cal!Y28,1)&IF(cal!$X$4=1,\" cm\",IF(cal!$X$4=2,\" in\"))&\" \"&$R$16&\" \"&ROUND(cal!AA28,1)&IF(cal!$X$4=1,\" cm\",IF(cal!$X$4=2,\" in\"))&\" \"&$R$17&\" \"&ROUND(cal!AC28,1)&IF(cal!$X$4=1,\" cm\",IF(cal!$X$4=2,\" in\"))&\" (Type 2)\"","v":"Clima Canal height 19 cm width 34 cm length 120 cm (Type 2)"}]
[]
[]
[]
[]
[]
[{"$f":"cal!$Z$1&\" \"&$R$15&\" \"&ROUND(cal!Y34,1)&IF(cal!$X$4=1,\" cm\",IF(cal!$X$4=2,\" in\"))&\" \"&$R$16&\" \"&ROUND(cal!AA34,1)&IF(cal!$X$4=1,\" cm\",IF(cal!$X$4=2,\" in\"))&\" \"&$R$17&\" \"&ROUND(cal!AC34,1)&IF(cal!$X$4=1,\" cm\",IF(cal!$X$4=2,\" in\"))&\" (Type 3)\"","v":"Clima Canal height 19 cm width 34 cm length 200 cm (Type 3)"}]
[]
[]
[]
[]
[]
[{"$f":"cal!$Z$1&\" \"&$R$15&\" \"&ROUND(cal!Y40,1)&IF(cal!$X$4=1,\" cm\",IF(cal!$X$4=2,\" in\"))&\" \"&$R$16&\" \"&ROUND(cal!AA40,1)&IF(cal!$X$4=1,\" cm\",IF(cal!$X$4=2,\" in\"))&\" \"&$R$17&\" \"&ROUND(cal!AC40,1)&IF(cal!$X$4=1,\" cm\",IF(cal!$X$4=2,\" in\"))&\" (Type 4)\"","v":"Clima Canal height 19 cm width 34 cm length 280 cm (Type 4)"}]
[]
[]
[]
[]
[]
[{"$f":"cal!$Z$1&\" \"&$R$15&\" \"&ROUND(cal!Y46,1)&IF(cal!$X$4=1,\" cm\",IF(cal!$X$4=2,\" in\"))&\" \"&$R$16&\" \"&ROUND(cal!AA46,1)&IF(cal!$X$4=1,\" cm\",IF(cal!$X$4=2,\" in\"))&\" \"&$R$17&\" \"&ROUND(cal!AC46,1)&IF(cal!$X$4=1,\" cm\",IF(cal!$X$4=2,\" in\"))&\" (Type 5)\"","v":"Clima Canal height 0 cm width 0 cm length 0 cm (Type 5)"}]
[]
[]
[]
[]
[]
[{"$f":"cal!$Z$1&\" \"&$R$15&\" \"&ROUND(cal!Y52,1)&IF(cal!$X$4=1,\" cm\",IF(cal!$X$4=2,\" in\"))&\" \"&$R$16&\" \"&ROUND(cal!AA52,1)&IF(cal!$X$4=1,\" cm\",IF(cal!$X$4=2,\" in\"))&\" \"&$R$17&\" \"&ROUND(cal!AC52,1)&IF(cal!$X$4=1,\" cm\",IF(cal!$X$4=2,\" in\"))&\" (Type 6)\"","v":"Clima Canal height 0 cm width 0 cm length 0 cm (Type 6)"}]
[]
[]
[]
[]
[]
[{"$f":"cal!$Z$1&\" \"&$R$15&\" \"&ROUND(cal!Y58,1)&IF(cal!$X$4=1,\" cm\",IF(cal!$X$4=2,\" in\"))&\" \"&$R$16&\" \"&ROUND(cal!AA58,1)&IF(cal!$X$4=1,\" cm\",IF(cal!$X$4=2,\" in\"))&\" \"&$R$17&\" \"&ROUND(cal!AC58,1)&IF(cal!$X$4=1,\" cm\",IF(cal!$X$4=2,\" in\"))&\" (Type 7)\"","v":"Clima Canal height 0 cm width 0 cm length 0 cm (Type 7)"}]
[]
[]
[]
[]
[]
[{"$f":"cal!$Z$1&\" \"&$R$15&\" \"&ROUND(cal!Y64,1)&IF(cal!$X$4=1,\" cm\",IF(cal!$X$4=2,\" in\"))&\" \"&$R$16&\" \"&ROUND(cal!AA64,1)&IF(cal!$X$4=1,\" cm\",IF(cal!$X$4=2,\" in\"))&\" \"&$R$17&\" \"&ROUND(cal!AC64,1)&IF(cal!$X$4=1,\" cm\",IF(cal!$X$4=2,\" in\"))&\" (Type 8)\"","v":"Clima Canal height 0 cm width 0 cm length 0 cm (Type 8)"}]
[]
[]
[]
[]
[]
[{"$f":"cal!$Z$1&\" \"&$R$15&\" \"&ROUND(cal!Y70,1)&IF(cal!$X$4=1,\" cm\",IF(cal!$X$4=2,\" in\"))&\" \"&$R$16&\" \"&ROUND(cal!AA70,1)&IF(cal!$X$4=1,\" cm\",IF(cal!$X$4=2,\" in\"))&\" \"&$R$17&\" \"&ROUND(cal!AC70,1)&IF(cal!$X$4=1,\" cm\",IF(cal!$X$4=2,\" in\"))&\" (Type 9)\"","v":"Clima Canal height 0 cm width 0 cm length 0 cm (Type 9)"}]
[]
[]
[]
[]
[]
["*Values according to EN 16430",null,null,null,null,null,null,null,null,null,null,null,{"$f":"cal!N70","v":"v2021-04-19"}]
["**Sound power according to ISO 3741:2010"]
["***Sound pressure with an assumed room damping of 8dB(A)"]